program: Orca
programVersion: 5.0.2
elementType: O O O O C C C C C C C C C C C C C C C C C C C C C C C C H H H H H H H H H H H H H H H H H H H H H H H H H H H H H H H H
charge: 0
multiplicity: 1
keywords: wb97x-d3
keywords: def2-TZVPP
keywords: def2/J RIJCOSX
keywords: DEFGRID2
keywords: scfconv7
keywords: smallprint printgap noloewdin
keywords: NOSOSCF
formula: C24H32O4
InChI: InChI=1/C24H32O4/c1-3-4-5-6-7-8-9-10-11-12-17-21-22(26)19-15-13-14-16-20(19)23(27)24(21)28-18(2)25/h13-16H,3-12,17H2,1-2H3
60 atoms
O  2.550504 -1.726075 -1.878937
O  1.889981 2.69797 -0.485739
O  0.071471 -1.664857 -2.851748
O  1.365171 -2.952465 -0.425743
C  0.759991 -1.34035 2.838108
C  -0.750363 -1.151349 2.957581
C  1.456488 -0.234666 2.055649
C  -1.484197 -1.183425 1.618676
C  2.953593 -0.473078 1.887253
C  -2.999292 -1.316828 1.753818
C  3.691924 0.626222 1.122582
C  -3.691008 -0.17555 2.496787
C  3.646124 0.513393 -0.410506
C  -3.569928 1.17601 1.80448
C  2.272319 0.442688 -0.998584
C  -4.333779 2.286302 2.514679
C  1.782421 -0.630129 -1.633898
C  1.422132 1.659313 -0.892375
C  -0.009594 1.562753 -1.273446
C  -0.500128 0.419153 -1.900178
C  -4.244641 3.624787 1.795619
C  0.407757 -0.708658 -2.194895
C  -0.862521 2.627692 -1.010391
C  -1.839434 0.341468 -2.261864
C  -2.198347 2.542575 -1.36316
C  -2.686465 1.401043 -1.98669
C  2.163622 -2.901009 -1.309853
C  2.879606 -4.052222 -1.940479
H  0.962295 -2.30088 2.355057
H  1.196206 -1.403102 3.840405
H  -0.95684 -0.210362 3.478921
H  -1.152438 -1.942575 3.599346
H  1.297761 0.726834 2.55693
H  0.980815 -0.149082 1.078616
H  -1.247335 -0.289692 1.033704
H  -1.108452 -2.024691 1.028109
H  3.400977 -0.565155 2.88168
H  3.115532 -1.440587 1.40112
H  -3.436651 -1.402608 0.753702
H  -3.226424 -2.259381 2.262037
H  4.74996 0.605303 1.3950
H  3.324404 1.605682 1.433465
H  -3.301969 -0.100703 3.5173
H  -4.752183 -0.422079 2.605087
H  4.216222 -0.363328 -0.71673
H  4.15784 1.381583 -0.832901
H  -2.517426 1.464701 1.718485
H  -3.934893 1.084916 0.775224
H  -3.952439 2.393752 3.534603
H  -5.38431 1.997413 2.616962
H  -3.207974 3.952104 1.69602
H  -4.668256 3.561552 0.791171
H  -4.785939 4.406533 2.329021
H  -0.475251 3.515125 -0.528842
H  -2.209556 -0.54887 -2.751557
H  -2.865107 3.366034 -1.145699
H  -3.731983 1.339678 -2.257771
H  2.457238 -4.232281 -2.930217
H  2.752412 -4.946484 -1.337866
H  3.940168 -3.84301 -2.071739
totalener: -1234.87011936 hartree
nucrepener: 2817.73127918 hartree
electener: -4052.60139854 hartree
oneelecener: -7281.36714008 hartree
twoeener: 3228.76574154 hartree
kineticenergy: 1229.34453854 hartree
xcener: -121.324599204631 hartree
chargesum: 0.0000000
charge: -0.285082 -0.324150 -0.325591 -0.332303 -0.145555 -0.139333 0.006284 -0.055447 -0.148098 -0.154858 -0.154706 -0.132175 -0.143125 -0.090697 -0.063103 -0.079097 0.242893 0.259838 0.019486 -0.150900 -0.269697 0.312396 -0.111470 -0.054478 -0.107024 -0.128848 0.376531 -0.251627 0.068423 0.067882 0.056904 0.072116 0.071501 -0.068966 -0.008344 0.090483 0.078455 0.062490 0.067535 0.074048 0.082006 0.089687 0.065599 0.070490 0.091583 0.103980 0.052214 0.039742 0.056728 0.052791 0.074561 0.064112 0.094062 0.132102 0.133432 0.138757 0.135405 0.113876 0.104407 0.101877
qa: -0.2851 -0.3242 -0.3256 -0.3323 -0.1456 -0.1393 0.0063 -0.0554 -0.1481 -0.1549 -0.1547 -0.1322 -0.1431 -0.0907 -0.0631 -0.0791 0.2429 0.2598 0.0195 -0.1509 -0.2697 0.3124 -0.1115 -0.0545 -0.1070 -0.1288 0.3765 -0.2516 0.0684 0.0679 0.0569 0.0721 0.0715 -0.0690 -0.0083 0.0905 0.0785 0.0625 0.0675 0.0740 0.0820 0.0897 0.0656 0.0705 0.0916 0.1040 0.0522 0.0397 0.0567 0.0528 0.0746 0.0641 0.0941 0.1321 0.1334 0.1388 0.1354 0.1139 0.1044 0.1019
va: 2.1217 2.1576 2.1547 2.1515 3.9409 3.9302 3.7612 3.8147 3.8969 3.9293 3.8837 3.9000 3.8742 3.8672 3.6583 3.8835 3.6865 4.0059 3.6095 3.7306 3.9470 4.0989 3.9665 3.9113 3.8935 3.9108 4.0742 3.9131 1.0174 1.0127 1.0057 1.0120 1.0168 1.0986 1.0218 1.0216 1.0089 1.0159 1.0114 1.0100 1.0078 1.0179 1.0061 1.0127 1.0186 1.0173 1.0026 1.0143 1.0079 1.0089 1.0008 1.0012 1.0111 1.0270 1.0218 0.9974 1.0010 1.0044 1.0136 1.0059
dispcorr: -0.037026022 hartree
energy: -1234.907145383359
dipole: -19.38024 19.43620 0.05596 2.29830 -2.36467 -0.06636 32.84118 -33.06925 -0.22807
magnitude: 0.24403 au
magnitude: 0.62027 debye
