program: Orca
programVersion: 5.0.2
elementType: O O O O C C C C C C C C C C C C C C C C C C C C C C C C H H H H H H H H H H H H H H H H H H H H H H H H H H H H H H H H
charge: 0
multiplicity: 1
keywords: wb97x-d3
keywords: def2-TZVPP
keywords: def2/J RIJCOSX
keywords: DEFGRID2
keywords: scfconv7
keywords: smallprint printgap noloewdin
keywords: NOSOSCF
formula: C24H32O4
InChI: InChI=1/C24H32O4/c1-3-4-5-6-7-8-9-10-11-12-17-21-22(26)19-15-13-14-16-20(19)23(27)24(21)28-18(2)25/h13-16H,3-12,17H2,1-2H3
60 atoms
O  1.477795 -1.923729 -0.655791
O  1.881825 2.749369 -0.797351
O  -1.014843 -1.637569 -1.515125
O  1.621345 -2.411293 -2.837056
C  1.704177 -1.571096 3.863685
C  0.209416 -1.289676 3.716753
C  2.566083 -1.081321 2.697533
C  -0.421369 -1.926896 2.483423
C  2.371306 0.395396 2.372442
C  -1.847544 -1.471738 2.190248
C  3.318155 0.949766 1.314113
C  -1.961726 0.018415 1.884242
C  3.164429 0.349215 -0.092868
C  -3.317633 0.422144 1.323652
C  1.775344 0.412832 -0.654535
C  -3.433405 1.918984 1.068476
C  1.033261 -0.669419 -0.928585
C  1.213746 1.75471 -0.964646
C  -0.162293 1.852717 -1.520046
C  -0.919999 0.707697 -1.755153
C  -4.782037 2.321614 0.492213
C  -0.368891 -0.620649 -1.423857
C  -0.691466 3.101933 -1.821182
C  -2.197448 0.810413 -2.291676
C  -1.964503 3.20102 -2.357576
C  -2.715545 2.057128 -2.596761
C  1.601412 -2.786886 -1.708062
C  1.713388 -4.193267 -1.214174
H  1.862616 -2.646173 3.993914
H  2.05783 -1.101587 4.786824
H  0.053177 -0.208275 3.703012
H  -0.30998 -1.646704 4.611447
H  2.369501 -1.690145 1.812514
H  3.618294 -1.255119 2.946215
H  0.186784 -1.713543 1.602047
H  -0.401542 -3.01564 2.595014
H  1.337778 0.578726 2.061973
H  2.507627 0.979561 3.288406
H  -2.22113 -2.038111 1.332034
H  -2.504849 -1.721805 3.029839
H  4.352338 0.777911 1.626502
H  3.196333 2.03082 1.255087
H  -1.181588 0.304538 1.168526
H  -1.760972 0.605093 2.785796
H  3.506422 -0.684725 -0.090391
H  3.830693 0.892178 -0.767764
H  -3.499449 -0.122027 0.390176
H  -4.107837 0.106964 2.014287
H  -2.636627 2.232424 0.387685
H  -3.260042 2.460277 2.003707
H  -5.597185 2.06316 1.170358
H  -4.835305 3.395013 0.307562
H  -4.973534 1.814777 -0.455402
H  -0.101504 3.988972 -1.63582
H  -2.773519 -0.086932 -2.471908
H  -2.374432 4.174465 -2.59125
H  -3.708466 2.140328 -3.017711
H  2.000478 -4.854069 -2.026385
H  0.745572 -4.510365 -0.823212
H  2.434314 -4.273833 -0.401527
totalener: -1234.87158798 hartree
nucrepener: 2853.62396352 hartree
electener: -4088.49555150 hartree
oneelecener: -7352.78382463 hartree
twoeener: 3264.28827314 hartree
kineticenergy: 1229.34875942 hartree
xcener: -121.328185364122 hartree
chargesum: 0.0000000
charge: -0.290668 -0.330503 -0.335770 -0.306436 -0.162807 -0.135834 -0.123593 -0.097434 -0.102539 -0.129326 -0.183198 -0.062844 -0.145342 -0.146226 -0.086290 -0.075432 0.193536 0.339156 -0.084541 -0.082263 -0.272178 0.343938 -0.073473 -0.099971 -0.092988 -0.135990 0.350561 -0.255723 0.067975 0.073216 0.069736 0.076195 0.057231 0.072363 0.022249 0.076307 0.050710 0.082795 0.077808 0.069237 0.074354 0.109690 -0.020424 0.076847 0.092708 0.107288 0.060126 0.071510 0.040642 0.068667 0.085387 0.086409 0.065762 0.136184 0.137992 0.133143 0.136912 0.109704 0.114044 0.101409
qa: -0.2907 -0.3305 -0.3358 -0.3064 -0.1628 -0.1358 -0.1236 -0.0974 -0.1025 -0.1293 -0.1832 -0.0628 -0.1453 -0.1462 -0.0863 -0.0754 0.1935 0.3392 -0.0845 -0.0823 -0.2722 0.3439 -0.0735 -0.1000 -0.0930 -0.1360 0.3506 -0.2557 0.0680 0.0732 0.0697 0.0762 0.0572 0.0724 0.0222 0.0763 0.0507 0.0828 0.0778 0.0692 0.0744 0.1097 -0.0204 0.0768 0.0927 0.1073 0.0601 0.0715 0.0406 0.0687 0.0854 0.0864 0.0658 0.1362 0.1380 0.1331 0.1369 0.1097 0.1140 0.1014
va: 2.0607 2.1527 2.1225 2.1956 3.9411 3.8761 3.8344 3.8995 3.8424 3.8942 3.9059 3.8673 3.8379 3.9065 3.7110 3.8559 3.6916 3.9853 3.7474 3.6778 3.9424 3.9173 3.9610 3.8811 3.9290 3.9169 4.1474 3.8977 1.0108 1.0093 1.0027 1.0120 1.0141 1.0154 1.0195 1.0165 1.0070 1.0116 1.0139 1.0105 1.0116 1.0174 1.0397 1.0115 1.0147 1.0146 1.0103 1.0133 1.0102 1.0146 1.0064 1.0058 1.0028 1.0253 1.0250 1.0014 1.0000 1.0152 1.0035 1.0041
dispcorr: -0.038549325 hartree
energy: -1234.910137303612
dipole: -11.51413 11.21794 -0.29619 -2.99342 2.94918 -0.04424 33.07388 -32.60671 0.46717
magnitude: 0.55492 au
magnitude: 1.41050 debye
