program: Orca
programVersion: 5.0.2
elementType: O O O O C C C C C C C C C C C C C C C C C C C C C C C C H H H H H H H H H H H H H H H H H H H H H H H H H H H H H H H H
charge: 0
multiplicity: 1
keywords: wb97x-d3
keywords: def2-TZVPP
keywords: def2/J RIJCOSX
keywords: DEFGRID2
keywords: scfconv7
keywords: smallprint printgap noloewdin
keywords: NOSOSCF
formula: C24H32O4
InChI: InChI=1/C24H32O4/c1-3-4-5-6-7-8-9-10-11-12-17-21-22(26)19-15-13-14-16-20(19)23(27)24(21)28-18(2)25/h13-16H,3-12,17H2,1-2H3
60 atoms
O  2.110964 -1.891439 -1.843328
O  2.309575 2.619092 -0.624418
O  -0.464046 -1.539303 -2.366053
O  1.196438 -2.962159 -0.098386
C  1.038816 -0.029642 3.483025
C  0.318026 -1.353652 3.239365
C  1.798548 0.530716 2.283698
C  -0.760593 -1.312497 2.159615
C  3.039121 -0.276282 1.903597
C  -1.825825 -0.243162 2.371289
C  3.968983 0.430262 0.911894
C  -3.028267 -0.422054 1.453077
C  3.692794 0.170345 -0.57892
C  -4.022469 0.727614 1.527428
C  2.26237 0.305313 -0.991874
C  -5.245063 0.528687 0.641011
C  1.545083 -0.699329 -1.513926
C  1.635307 1.650076 -0.88763
C  0.173521 1.775093 -1.12145
C  -0.561621 0.694136 -1.604996
C  -6.206501 1.707269 0.679681
C  0.108387 -0.594331 -1.877143
C  -0.460371 2.986158 -0.873696
C  -1.923102 0.829205 -1.847563
C  -1.820865 3.111104 -1.09991
C  -2.551132 2.035463 -1.589541
C  1.729842 -3.008181 -1.163205
C  2.094847 -4.237222 -1.932455
H  1.737782 -0.154179 4.316629
H  0.313986 0.716894 3.819696
H  -0.139896 -1.670945 4.181864
H  1.041012 -2.132183 2.981474
H  2.108538 1.554547 2.514236
H  1.114083 0.613754 1.434586
H  -0.30146 -1.176358 1.177575
H  -1.237413 -2.296084 2.115373
H  3.603442 -0.467238 2.821589
H  2.752241 -1.260064 1.520912
H  -2.162875 -0.252528 3.414395
H  -1.394119 0.749576 2.203922
H  4.996879 0.103865 1.086867
H  3.961141 1.503876 1.10565
H  -3.53345 -1.362808 1.697164
H  -2.681058 -0.529851 0.420337
H  4.040854 -0.830445 -0.831892
H  4.296248 0.866198 -1.16753
H  -4.347159 0.867606 2.564508
H  -3.516272 1.657186 1.24369
H  -5.769302 -0.382556 0.943711
H  -4.920602 0.353314 -0.390099
H  -6.572056 1.886464 1.691979
H  -5.720327 2.625695 0.344191
H  -7.074948 1.541946 0.041497
H  0.116378 3.822413 -0.503034
H  -2.48168 -0.013078 -2.232758
H  -2.315318 4.051749 -0.897413
H  -3.613277 2.138963 -1.768028
H  1.98864 -5.117385 -1.305801
H  3.11135 -4.180017 -2.319329
H  1.42476 -4.328911 -2.788333
totalener: -1234.86817556 hartree
nucrepener: 2828.33449862 hartree
electener: -4063.20267419 hartree
oneelecener: -7302.54576313 hartree
twoeener: 3239.34308894 hartree
kineticenergy: 1229.34221240 hartree
xcener: -121.324007406301 hartree
chargesum: 0.0000000
charge: -0.286038 -0.319841 -0.329930 -0.331516 -0.162219 -0.169679 -0.034943 -0.026729 -0.127629 -0.140105 -0.156586 -0.121914 -0.157757 -0.113743 -0.008100 -0.102964 0.180125 0.211315 -0.000742 -0.147556 -0.254053 0.371524 -0.088883 -0.100331 -0.093821 -0.126997 0.379340 -0.249316 0.070559 0.078452 0.070690 0.082513 0.081016 -0.039808 0.000958 0.073778 0.073699 0.069450 0.067554 0.052392 0.082982 0.089217 0.073175 0.057554 0.090716 0.102310 0.074461 0.046047 0.066730 0.042423 0.077844 0.063415 0.087137 0.135883 0.144875 0.135032 0.137849 0.104611 0.101628 0.113947
qa: -0.2860 -0.3198 -0.3299 -0.3315 -0.1622 -0.1697 -0.0349 -0.0267 -0.1276 -0.1401 -0.1566 -0.1219 -0.1578 -0.1137 -0.0081 -0.1030 0.1801 0.2113 -0.0007 -0.1476 -0.2541 0.3715 -0.0889 -0.1003 -0.0938 -0.1270 0.3793 -0.2493 0.0706 0.0785 0.0707 0.0825 0.0810 -0.0398 0.0010 0.0738 0.0737 0.0694 0.0676 0.0524 0.0830 0.0892 0.0732 0.0576 0.0907 0.1023 0.0745 0.0460 0.0667 0.0424 0.0778 0.0634 0.0871 0.1359 0.1449 0.1350 0.1378 0.1046 0.1016 0.1139
va: 2.1173 2.1601 2.1459 2.1595 3.9310 3.9127 3.8245 3.8385 3.8538 3.8781 3.8813 3.8767 3.8852 3.8620 3.5675 3.8835 3.7980 4.0545 3.6522 3.7235 3.9445 4.0081 3.9833 3.8687 3.9250 3.9066 4.0762 3.9076 1.0121 1.0036 1.0088 1.0103 1.0163 1.0641 1.0382 1.0157 1.0094 1.0255 1.0157 1.0025 1.0062 1.0182 1.0150 1.0149 1.0175 1.0155 1.0125 1.0101 1.0112 1.0077 1.0045 1.0040 1.0058 1.0241 1.0235 1.0002 0.9941 1.0138 1.0061 1.0048
dispcorr: -0.037664253 hartree
energy: -1234.905839816510
dipole: -19.87010 19.86231 -0.00779 -1.26303 1.25841 -0.00462 28.04081 -28.42486 -0.38405
magnitude: 0.38415 au
magnitude: 0.97644 debye
