program: Orca
programVersion: 5.0.2
elementType: O O O O C C C C C C C C C C C C C C C C C C C C C C C C H H H H H H H H H H H H H H H H H H H H H H H H H H H H H H H H
charge: 0
multiplicity: 1
keywords: wb97x-d3
keywords: def2-TZVPP
keywords: def2/J RIJCOSX
keywords: DEFGRID2
keywords: scfconv7
keywords: smallprint printgap noloewdin
keywords: NOSOSCF
formula: C24H32O4
InChI: InChI=1/C24H32O4/c1-3-4-5-6-7-8-9-10-11-12-17-21-22(26)19-15-13-14-16-20(19)23(27)24(21)28-18(2)25/h13-16H,3-12,17H2,1-2H3
60 atoms
O  1.976927 -1.839873 -1.821155
O  2.359545 2.636022 -0.509817
O  -0.577336 -1.345039 -2.394988
O  0.810634 -2.894487 -0.222244
C  1.550203 -0.983537 2.935367
C  0.45307 0.046678 2.687273
C  2.943271 -0.388356 3.143572
C  -0.885087 -0.586521 2.329255
C  3.49237 0.356026 1.927497
C  -1.995759 0.434512 2.119962
C  3.826796 -0.556559 0.74333
C  -3.291853 -0.188183 1.618056
C  3.676007 0.111044 -0.632354
C  -4.437755 0.811278 1.521767
C  2.237346 0.341231 -0.991234
C  -5.738761 0.225791 0.979246
C  1.457713 -0.628148 -1.490489
C  1.656327 1.699647 -0.814205
C  0.194828 1.882578 -1.015883
C  -0.593126 0.843343 -1.507845
C  -5.661833 -0.209236 -0.478369
C  0.025488 -0.453511 -1.846658
C  -0.387567 3.109719 -0.723972
C  -1.954728 1.03199 -1.708941
C  -1.746837 3.291701 -0.916922
C  -2.52906 2.255593 -1.410774
C  1.45996 -2.948415 -1.220183
C  1.848081 -4.178769 -1.975335
H  1.561975 -1.692281 2.103036
H  1.285079 -1.575397 3.816579
H  0.739295 0.718015 1.871323
H  0.341604 0.685668 3.570467
H  3.637397 -1.186164 3.426615
H  2.914178 0.298606 3.994728
H  -0.760026 -1.186863 1.422313
H  -1.182638 -1.290965 3.113795
H  2.776097 1.122682 1.631623
H  4.389775 0.910385 2.212787
H  -2.181807 0.968217 3.058688
H  -1.663979 1.194648 1.403812
H  3.204624 -1.453329 0.76784
H  4.855717 -0.911538 0.840534
H  -3.587341 -1.008909 2.281504
H  -3.101612 -0.645782 0.642378
H  4.13914 -0.520495 -1.392217
H  4.208126 1.062443 -0.642478
H  -4.6232 1.229805 2.515978
H  -4.130084 1.657139 0.896705
H  -6.534934 0.967457 1.086222
H  -6.038269 -0.625652 1.597991
H  -6.620895 -0.590482 -0.829716
H  -5.389772 0.628568 -1.12457
H  -4.924561 -0.997382 -0.633691
H  0.227463 3.914805 -0.346083
H  -2.55574 0.220516 -2.096416
H  -2.199629 4.245866 -0.682701
H  -3.589949 2.402828 -1.563212
H  1.277546 -4.218293 -2.904508
H  1.626897 -5.064857 -1.388085
H  2.904299 -4.166573 -2.241292
totalener: -1234.87077117 hartree
nucrepener: 2822.83557036 hartree
electener: -4057.70634153 hartree
oneelecener: -7291.47273120 hartree
twoeener: 3233.76638967 hartree
kineticenergy: 1229.33787489 hartree
xcener: -121.323388525352 hartree
chargesum: -0.0000000
charge: -0.285458 -0.321129 -0.326708 -0.331453 -0.112934 -0.110054 -0.150009 -0.139624 -0.159156 -0.077238 -0.146587 -0.143786 -0.129030 -0.118962 -0.028232 -0.092634 0.179447 0.263059 -0.106795 -0.069981 -0.273423 0.303023 -0.049715 -0.081950 -0.089133 -0.152844 0.381269 -0.252066 0.067706 0.073912 0.028474 0.069618 0.072467 0.068290 0.066271 0.065625 0.082126 0.083518 0.071387 0.022526 0.068162 0.087280 0.072543 0.060828 0.096913 0.103473 0.074123 0.052604 0.066718 0.052602 0.093721 0.061800 0.081732 0.134538 0.142959 0.134139 0.145308 0.113410 0.104788 0.102541
qa: -0.2855 -0.3211 -0.3267 -0.3315 -0.1129 -0.1101 -0.1500 -0.1396 -0.1592 -0.0772 -0.1466 -0.1438 -0.1290 -0.1190 -0.0282 -0.0926 0.1794 0.2631 -0.1068 -0.0700 -0.2734 0.3030 -0.0497 -0.0820 -0.0891 -0.1528 0.3813 -0.2521 0.0677 0.0739 0.0285 0.0696 0.0725 0.0683 0.0663 0.0656 0.0821 0.0835 0.0714 0.0225 0.0682 0.0873 0.0725 0.0608 0.0969 0.1035 0.0741 0.0526 0.0667 0.0526 0.0937 0.0618 0.0817 0.1345 0.1430 0.1341 0.1453 0.1134 0.1048 0.1025
va: 2.1175 2.1491 2.1504 2.1578 3.8814 3.8804 3.9311 3.8949 3.8770 3.8399 3.8793 3.8797 3.8421 3.8849 3.6705 3.8843 3.7993 3.9870 3.7075 3.6652 3.9393 4.0598 3.9499 3.8633 3.9551 3.9183 4.0748 3.9115 1.0265 1.0130 1.0139 1.0168 1.0070 1.0094 1.0221 1.0163 1.0093 1.0098 1.0170 1.0232 1.0258 1.0080 1.0147 1.0077 1.0142 1.0249 1.0140 1.0116 1.0070 1.0099 1.0102 1.0029 1.0002 1.0246 1.0213 1.0011 0.9940 1.0048 1.0140 1.0056
dispcorr: -0.037466262 hartree
energy: -1234.908237428496
dipole: -17.83976 17.83559 -0.00416 -4.95683 4.91770 -0.03912 25.74003 -26.08097 -0.34094
magnitude: 0.34320 au
magnitude: 0.87235 debye
