program: Orca
programVersion: 5.0.2
elementType: O O O O C C C C C C C C C C C C C C C C C C C C C C C C H H H H H H H H H H H H H H H H H H H H H H H H H H H H H H H H
charge: 0
multiplicity: 1
keywords: wb97x-d3
keywords: def2-TZVPP
keywords: def2/J RIJCOSX
keywords: DEFGRID2
keywords: scfconv7
keywords: smallprint printgap noloewdin
keywords: NOSOSCF
formula: C24H32O4
InChI: InChI=1/C24H32O4/c1-3-4-5-6-7-8-9-10-11-12-17-21-22(26)19-15-13-14-16-20(19)23(27)24(21)28-18(2)25/h13-16H,3-12,17H2,1-2H3
60 atoms
O  1.761593 -1.483116 -2.168086
O  1.371571 -0.932866 2.474934
O  -0.880609 -1.754165 -2.265091
O  1.568251 -3.714466 -2.192705
C  1.88559 3.166638 1.6756
C  0.47103 2.610495 1.806242
C  2.924471 2.098533 1.334595
C  -0.586134 3.683848 2.029434
C  2.833014 1.622809 -0.113331
C  -1.980615 3.125636 2.309456
C  3.6353 0.36696 -0.435752
C  -2.559158 2.227145 1.218301
C  3.149993 -0.915031 0.263304
C  -2.743696 2.907146 -0.132044
C  1.671532 -1.14997 0.155644
C  -3.374306 1.991002 -1.174591
C  1.061076 -1.422979 -1.004082
C  0.848714 -1.090494 1.395019
C  -0.624216 -1.254523 1.287731
C  -1.230721 -1.4847 0.054657
C  -3.605667 2.680231 -2.511394
C  -0.407053 -1.580684 -1.167593
C  -1.404608 -1.175712 2.434961
C  -2.6108 -1.621181 -0.031054
C  -2.779111 -1.31651 2.346125
C  -3.382656 -1.534301 1.114532
C  1.852796 -2.708502 -2.762851
C  2.355419 -2.573177 -4.164607
H  2.160318 3.654854 2.61505
H  1.904523 3.952698 0.912024
H  0.446542 1.894054 2.634383
H  0.216284 2.036704 0.909588
H  2.806175 1.260825 2.026617
H  3.929991 2.49235 1.510397
H  -0.287789 4.312205 2.874684
H  -0.613651 4.352303 1.163033
H  1.788643 1.454819 -0.392227
H  3.175654 2.429676 -0.767782
H  -1.948923 2.559883 3.246174
H  -2.667497 3.959443 2.48592
H  4.68303 0.516331 -0.159471
H  3.626309 0.214195 -1.51586
H  -3.528394 1.848979 1.558304
H  -1.932796 1.339205 1.093554
H  3.419896 -0.890072 1.31753
H  3.679489 -1.770238 -0.164357
H  -3.365315 3.801386 -0.008517
H  -1.779584 3.26315 -0.510287
H  -4.324204 1.605622 -0.790658
H  -2.734164 1.115396 -1.319163
H  -2.669415 3.048914 -2.933601
H  -4.049152 2.002329 -3.24107
H  -4.275423 3.535318 -2.405945
H  -0.930081 -1.00095 3.390641
H  -3.070057 -1.795296 -0.994515
H  -3.384269 -1.251719 3.24047
H  -4.457371 -1.638051 1.048892
H  1.578392 -2.119414 -4.781065
H  2.600805 -3.550358 -4.56915
H  3.229847 -1.925361 -4.213108
totalener: -1234.87046205 hartree
nucrepener: 2805.04614929 hartree
electener: -4039.91661133 hartree
oneelecener: -7255.69546499 hartree
twoeener: 3215.77885365 hartree
kineticenergy: 1229.34367971 hartree
xcener: -121.324411688951 hartree
chargesum: -0.0000000
charge: -0.291106 -0.333386 -0.328882 -0.311875 -0.136292 -0.075271 -0.139944 -0.151128 -0.124563 -0.136128 -0.158517 -0.048582 -0.188621 -0.127716 -0.017613 -0.065344 0.186391 0.257082 -0.081052 -0.066805 -0.257366 0.366470 -0.079762 -0.120818 -0.113651 -0.075962 0.350322 -0.247995 0.071854 0.058599 0.066311 0.015761 0.079585 0.075959 0.071492 0.067011 0.068263 0.080509 0.069303 0.074163 0.078663 0.086531 0.072895 -0.024712 0.112434 0.102772 0.059744 0.054537 0.049531 0.043774 0.072045 0.085582 0.073405 0.132301 0.136564 0.132153 0.132298 0.113800 0.105099 0.099887
qa: -0.2911 -0.3334 -0.3289 -0.3119 -0.1363 -0.0753 -0.1399 -0.1511 -0.1246 -0.1361 -0.1585 -0.0486 -0.1886 -0.1277 -0.0176 -0.0653 0.1864 0.2571 -0.0811 -0.0668 -0.2574 0.3665 -0.0798 -0.1208 -0.1137 -0.0760 0.3503 -0.2480 0.0719 0.0586 0.0663 0.0158 0.0796 0.0760 0.0715 0.0670 0.0683 0.0805 0.0693 0.0742 0.0787 0.0865 0.0729 -0.0247 0.1124 0.1028 0.0597 0.0545 0.0495 0.0438 0.0720 0.0856 0.0734 0.1323 0.1366 0.1322 0.1323 0.1138 0.1051 0.0999
va: 2.1004 2.1296 2.1489 2.1873 3.9502 3.8459 3.8657 3.9106 3.8613 3.9138 3.8951 3.8594 3.8557 3.8911 3.6775 3.8887 3.7639 3.9627 3.7142 3.6712 3.9679 4.0184 3.8959 3.9338 3.9394 3.8968 4.1335 3.9017 1.0115 1.0088 1.0142 1.0058 1.0204 1.0131 1.0136 1.0038 1.0053 1.0105 1.0114 1.0095 1.0113 1.0159 1.0105 1.0311 1.0184 1.0118 1.0119 1.0056 1.0084 1.0098 1.0035 1.0061 1.0030 1.0275 1.0259 1.0006 1.0002 1.0040 1.0145 1.0045
dispcorr: -0.036191612 hartree
energy: -1234.906653657695
dipole: -6.22303 6.06519 -0.15784 38.48303 -37.91543 0.56760 2.36539 -2.51765 -0.15226
magnitude: 0.60849 au
magnitude: 1.54666 debye
