program: Orca
programVersion: 5.0.2
elementType: O O O O C C C C C C C C C C C C C C C C C C C C C C C C H H H H H H H H H H H H H H H H H H H H H H H H H H H H H H H H
charge: 0
multiplicity: 1
keywords: wb97x-d3
keywords: def2-TZVPP
keywords: def2/J RIJCOSX
keywords: DEFGRID2
keywords: scfconv7
keywords: smallprint printgap noloewdin
keywords: NOSOSCF
formula: C24H32O4
InChI: InChI=1/C24H32O4/c1-3-4-5-6-7-8-9-10-11-12-17-21-22(26)19-15-13-14-16-20(19)23(27)24(21)28-18(2)25/h13-16H,3-12,17H2,1-2H3
60 atoms
O  1.480768 -1.760567 -2.007302
O  2.773849 2.456017 -0.421453
O  -0.825633 -0.646341 -2.746982
O  0.048769 -2.486681 -0.443692
C  1.349517 -0.079546 4.050684
C  0.20244 0.727888 3.439323
C  2.138464 -0.930313 3.053763
C  -0.78425 -0.090478 2.612788
C  2.627884 -0.144486 1.845713
C  -1.867836 0.768442 1.967951
C  3.285254 -1.012614 0.78035
C  -2.739267 0.016447 0.967693
C  3.474957 -0.292041 -0.564622
C  -3.572948 -1.115328 1.554619
C  2.179606 0.275425 -1.063035
C  -4.452609 -1.786745 0.50676
C  1.244472 -0.463591 -1.671797
C  1.903671 1.719349 -0.824408
C  0.52621 2.225103 -1.059062
C  -0.430834 1.422263 -1.676486
C  -5.274907 -2.940235 1.062412
C  -0.081092 0.051608 -2.100874
C  0.191586 3.512558 -0.658242
C  -1.714802 1.90546 -1.892991
C  -1.094635 3.984864 -0.859924
C  -2.046784 3.183095 -1.476891
C  0.706801 -2.711092 -1.41279
C  0.830873 -4.015199 -2.132893
H  0.954863 -0.735147 4.832605
H  2.031174 0.612047 4.555178
H  0.609552 1.531405 2.816612
H  -0.335937 1.234712 4.24617
H  1.512203 -1.755935 2.701793
H  2.983937 -1.396228 3.568978
H  -0.259433 -0.632248 1.819401
H  -1.235847 -0.859712 3.247192
H  1.762547 0.354019 1.404549
H  3.307632 0.655409 2.155227
H  -2.49653 1.218968 2.743913
H  -1.390099 1.604247 1.444574
H  2.67454 -1.905531 0.627117
H  4.25957 -1.36763 1.126489
H  -2.102518 -0.393952 0.177556
H  -3.40751 0.730562 0.474994
H  3.884514 -0.989064 -1.297197
H  4.197549 0.515803 -0.452282
H  -2.918194 -1.868485 2.003431
H  -4.198782 -0.731597 2.368561
H  -3.819947 -2.147641 -0.309646
H  -5.12051 -1.041681 0.062779
H  -4.632254 -3.720501 1.473548
H  -5.937189 -2.607185 1.863513
H  -5.896141 -3.398708 0.292409
H  0.938574 4.134767 -0.184883
H  -2.448527 1.272928 -2.373578
H  -1.357252 4.982938 -0.535685
H  -3.050061 3.556371 -1.632644
H  0.3058 -3.946394 -3.086731
H  0.38645 -4.811504 -1.543578
H  1.871023 -4.253715 -2.350267
totalener: -1234.87109814 hartree
nucrepener: 2828.02393092 hartree
electener: -4062.89502906 hartree
oneelecener: -7302.02304722 hartree
twoeener: 3239.12801816 hartree
kineticenergy: 1229.34516831 hartree
xcener: -121.324162538474 hartree
chargesum: -0.0000000
charge: -0.285039 -0.322013 -0.322406 -0.333456 -0.169644 -0.112389 -0.128673 -0.130533 -0.070316 -0.096093 -0.153538 -0.103081 -0.131848 -0.115937 -0.072977 -0.077176 0.217084 0.329857 -0.119686 -0.041251 -0.261471 0.255666 -0.090582 -0.101132 -0.096295 -0.088483 0.376542 -0.250271 0.070999 0.072164 0.060558 0.076588 0.070409 0.073895 0.046327 0.076396 -0.020276 0.093053 0.073197 0.040527 0.067931 0.083663 0.043806 0.058481 0.096930 0.104305 0.060412 0.053112 0.060746 0.045597 0.072907 0.069739 0.082319 0.134814 0.136649 0.133442 0.135236 0.113939 0.104999 0.102276
qa: -0.2850 -0.3220 -0.3224 -0.3335 -0.1696 -0.1124 -0.1287 -0.1305 -0.0703 -0.0961 -0.1535 -0.1031 -0.1318 -0.1159 -0.0730 -0.0772 0.2171 0.3299 -0.1197 -0.0413 -0.2615 0.2557 -0.0906 -0.1011 -0.0963 -0.0885 0.3765 -0.2503 0.0710 0.0722 0.0606 0.0766 0.0704 0.0739 0.0463 0.0764 -0.0203 0.0931 0.0732 0.0405 0.0679 0.0837 0.0438 0.0585 0.0969 0.1043 0.0604 0.0531 0.0607 0.0456 0.0729 0.0697 0.0823 0.1348 0.1366 0.1334 0.1352 0.1139 0.1050 0.1023
va: 2.1246 2.1567 2.1499 2.1540 3.9294 3.8584 3.8958 3.8528 3.8137 3.8725 3.9154 3.9106 3.8571 3.9046 3.6942 3.8886 3.7616 3.9609 3.7541 3.6102 3.9543 4.0957 3.9692 3.9225 3.9473 3.9268 4.0722 3.9132 1.0100 1.0083 1.0039 1.0089 1.0046 1.0106 1.0151 1.0118 1.0431 1.0155 1.0141 1.0207 1.0196 1.0151 1.0144 1.0116 1.0148 1.0267 1.0100 1.0095 1.0091 1.0086 1.0036 1.0029 1.0059 1.0250 1.0238 1.0002 0.9996 1.0045 1.0134 1.0058
dispcorr: -0.036227675 hartree
energy: -1234.907325813766
dipole: -17.37247 17.41997 0.04750 -14.82726 14.79185 -0.03541 30.47529 -30.74728 -0.27199
magnitude: 0.27837 au
magnitude: 0.70755 debye
