program: Orca
programVersion: 5.0.2
elementType: O O O O C C C C C C C C C C C C C C C C C C C C C C C C H H H H H H H H H H H H H H H H H H H H H H H H H H H H H H H H
charge: 0
multiplicity: 1
keywords: wb97x-d3
keywords: def2-TZVPP
keywords: def2/J RIJCOSX
keywords: DEFGRID2
keywords: scfconv7
keywords: smallprint printgap noloewdin
keywords: NOSOSCF
formula: C24H32O4
InChI: InChI=1/C24H32O4/c1-3-4-5-6-7-8-9-10-11-12-17-21-22(26)19-15-13-14-16-20(19)23(27)24(21)28-18(2)25/h13-16H,3-12,17H2,1-2H3
60 atoms
O  1.438641 -1.844289 -1.857197
O  2.664219 2.420719 -0.361269
O  -0.894283 -0.788815 -2.565784
O  -0.040239 -2.65501 -0.380561
C  1.485572 0.3488 2.870487
C  0.033613 0.467656 3.328746
C  1.79442 -0.978619 2.186287
C  -0.983295 0.452762 2.192389
C  3.266876 -1.191587 1.844579
C  -2.418696 0.587747 2.684206
C  3.910915 -0.17568 0.904491
C  -3.456612 0.66134 1.566336
C  3.487394 -0.25415 -0.57074
C  -3.482837 -0.533668 0.616266
C  2.103993 0.210731 -0.912836
C  -3.766115 -1.870708 1.289441
C  1.174314 -0.560368 -1.495099
C  1.79649 1.652474 -0.708994
C  0.408264 2.129237 -0.933322
C  -0.540973 1.295637 -1.518955
C  -3.849926 -3.017123 0.291801
C  -0.166401 -0.074014 -1.918887
C  0.058818 3.4221 -0.565163
C  -1.833636 1.752834 -1.739092
C  -1.236171 3.869176 -0.767736
C  -2.181145 3.036415 -1.353976
C  0.642902 -2.823771 -1.343375
C  0.773839 -4.08143 -2.139968
H  2.145472 0.468485 3.73627
H  1.716698 1.186253 2.204475
H  -0.085859 1.393784 3.899811
H  -0.192143 -0.346525 4.026461
H  1.181202 -1.089479 1.293299
H  1.482247 -1.791879 2.849811
H  -0.76006 1.270512 1.497664
H  -0.880575 -0.470894 1.616279
H  3.841662 -1.191028 2.776408
H  3.389964 -2.194646 1.422423
H  -2.650379 -0.244976 3.355783
H  -2.504768 1.491182 3.296544
H  4.989722 -0.351118 0.914507
H  3.781733 0.838532 1.281466
H  -3.278852 1.57015 0.982461
H  -4.448747 0.780003 2.014049
H  3.625431 -1.276794 -0.922924
H  4.181565 0.363847 -1.146955
H  -4.248279 -0.352866 -0.146141
H  -2.538064 -0.606548 0.069823
H  -4.699742 -1.801903 1.857377
H  -2.982778 -2.092203 2.019267
H  -2.910461 -3.128464 -0.250845
H  -4.059859 -3.965227 0.788058
H  -4.639658 -2.847435 -0.442462
H  0.801655 4.068211 -0.118024
H  -2.561513 1.097923 -2.198002
H  -1.510823 4.872104 -0.469517
H  -3.191004 3.390704 -1.511473
H  1.815967 -4.313737 -2.354176
H  0.265313 -3.94817 -3.096003
H  0.313663 -4.909539 -1.60957
totalener: -1234.86965095 hartree
nucrepener: 2874.93251415 hartree
electener: -4109.80216510 hartree
oneelecener: -7395.89700024 hartree
twoeener: 3286.09483514 hartree
kineticenergy: 1229.34637693 hartree
xcener: -121.327969229222 hartree
chargesum: 0.0000000
charge: -0.287417 -0.323667 -0.322772 -0.340588 -0.149274 -0.139426 -0.035022 -0.068031 -0.163257 -0.147872 -0.162366 -0.139169 -0.108266 -0.101699 -0.105276 -0.091766 0.257269 0.223972 -0.106687 -0.017362 -0.250427 0.284469 -0.067235 -0.111220 -0.082106 -0.124768 0.397173 -0.251963 0.079752 0.060032 0.066465 0.060217 0.006196 0.077419 0.023707 0.060556 0.075782 0.063849 0.069575 0.066804 0.081430 0.100368 0.062670 0.079294 0.089163 0.104774 0.068567 0.028616 0.057771 0.057170 0.079735 0.077478 0.066492 0.135305 0.137874 0.134682 0.138755 0.104257 0.114471 0.105527
qa: -0.2874 -0.3237 -0.3228 -0.3406 -0.1493 -0.1394 -0.0350 -0.0680 -0.1633 -0.1479 -0.1624 -0.1392 -0.1083 -0.1017 -0.1053 -0.0918 0.2573 0.2240 -0.1067 -0.0174 -0.2504 0.2845 -0.0672 -0.1112 -0.0821 -0.1248 0.3972 -0.2520 0.0798 0.0600 0.0665 0.0602 0.0062 0.0774 0.0237 0.0606 0.0758 0.0638 0.0696 0.0668 0.0814 0.1004 0.0627 0.0793 0.0892 0.1048 0.0686 0.0286 0.0578 0.0572 0.0797 0.0775 0.0665 0.1353 0.1379 0.1347 0.1388 0.1043 0.1145 0.1055
va: 2.1173 2.1488 2.1498 2.1396 3.8915 3.9442 3.8426 3.8515 3.9337 3.9298 3.8797 3.8776 3.8403 3.8885 3.6655 3.8941 3.6801 4.0220 3.7198 3.6055 3.9525 4.0653 3.9431 3.9143 3.9394 3.9226 4.0437 3.9160 1.0129 1.0157 1.0121 1.0111 1.0382 1.0146 1.0317 1.0012 1.0069 1.0105 1.0036 1.0130 1.0072 1.0142 1.0166 1.0095 1.0229 1.0133 1.0098 1.0058 1.0086 1.0059 1.0116 1.0064 1.0048 1.0246 1.0208 0.9990 0.9995 1.0060 1.0047 1.0126
dispcorr: -0.038750605 hartree
energy: -1234.908401552378
dipole: -13.67584 13.78228 0.10644 -12.66186 12.69486 0.03299 26.55919 -26.91027 -0.35108
magnitude: 0.36834 au
magnitude: 0.93625 debye
