program: Orca
programVersion: 5.0.2
elementType: O O O O C C C C C C C C C C C C C C C C C C C C C C C C H H H H H H H H H H H H H H H H H H H H H H H H H H H H H H H H
charge: 0
multiplicity: 1
keywords: wb97x-d3
keywords: def2-TZVPP
keywords: def2/J RIJCOSX
keywords: DEFGRID2
keywords: scfconv7
keywords: smallprint printgap noloewdin
keywords: NOSOSCF
formula: C24H32O4
InChI: InChI=1/C24H32O4/c1-3-4-5-6-7-8-9-10-11-12-17-21-22(26)19-15-13-14-16-20(19)23(27)24(21)28-18(2)25/h13-16H,3-12,17H2,1-2H3
60 atoms
O  2.901618 -1.642392 -1.913427
O  1.910577 2.610206 -0.22867
O  0.561784 -1.538731 -3.192922
O  1.570504 -3.129773 -0.88943
C  0.697642 -0.316269 2.807212
C  -0.186916 -1.294641 2.036765
C  2.088751 -0.871959 3.120753
C  -1.439698 -0.669595 1.433523
C  2.995714 -0.96896 1.893929
C  -2.419393 -0.079039 2.439184
C  3.503609 0.391968 1.410064
C  -3.670374 0.474886 1.768918
C  3.7222 0.476967 -0.108146
C  -4.677385 1.071564 2.742567
C  2.433059 0.413764 -0.867843
C  -5.922031 1.620657 2.056348
C  2.05832 -0.610909 -1.646926
C  1.531273 1.594051 -0.76471
C  0.155715 1.491739 -1.31458
C  -0.219758 0.392462 -2.0834
C  -6.931234 2.207873 3.032228
C  0.766962 -0.663487 -2.386983
C  -0.764503 2.498733 -1.051772
C  -1.513581 0.295893 -2.579346
C  -2.058127 2.391869 -1.534429
C  -2.433409 1.290424 -2.293352
C  2.479525 -2.907587 -1.627181
C  3.320973 -3.912037 -2.346313
H  0.206747 -0.036972 3.743209
H  0.790796 0.617285 2.239468
H  -0.470227 -2.118863 2.700493
H  0.381038 -1.753658 1.223914
H  1.980809 -1.862514 3.572706
H  2.572437 -0.247466 3.878429
H  -1.144962 0.110536 0.723554
H  -1.957471 -1.42815 0.837979
H  3.849223 -1.614888 2.11603
H  2.449301 -1.47765 1.096764
H  -2.702589 -0.84626 3.168656
H  -1.935694 0.718309 3.012585
H  4.450984 0.626098 1.901294
H  2.820315 1.186309 1.712823
H  -4.152979 -0.322015 1.192189
H  -3.377042 1.235327 1.03634
H  4.389633 -0.3218 -0.431498
H  4.219164 1.420306 -0.342979
H  -4.972614 0.310911 3.473562
H  -4.198788 1.87053 3.319581
H  -6.395668 0.822968 1.475901
H  -5.62698 2.384679 1.330209
H  -7.811312 2.59406 2.517458
H  -7.271743 1.457634 3.747641
H  -6.497264 3.030147 3.60355
H  -0.464296 3.353603 -0.461522
H  -1.793935 -0.560176 -3.177538
H  -2.778626 3.169278 -1.317563
H  -3.446233 1.210222 -2.664336
H  3.135189 -4.906778 -1.953478
H  4.381003 -3.675408 -2.26658
H  3.061854 -3.896614 -3.405882
totalener: -1234.87096951 hartree
nucrepener: 2747.07906006 hartree
electener: -3981.95002957 hartree
oneelecener: -7139.94303950 hartree
twoeener: 3157.99300992 hartree
kineticenergy: 1229.33519808 hartree
xcener: -121.320867229761 hartree
chargesum: 0.0000000
charge: -0.285061 -0.326437 -0.324026 -0.329364 -0.139160 -0.152648 -0.162647 -0.037721 -0.078048 -0.126452 -0.199146 -0.081823 -0.102210 -0.111091 -0.064375 -0.075671 0.189733 0.261615 -0.089873 -0.076448 -0.259716 0.318281 -0.026613 -0.087555 -0.171194 -0.068490 0.394041 -0.258011 0.082524 0.059321 0.065720 0.089845 0.069860 0.075575 -0.028669 0.076854 0.082034 0.024554 0.057679 0.058090 0.083257 0.099626 0.054642 0.035386 0.089687 0.102402 0.053289 0.051808 0.051405 0.047017 0.083298 0.072986 0.072591 0.134536 0.134400 0.136426 0.133751 0.104843 0.101891 0.113484
qa: -0.2851 -0.3264 -0.3240 -0.3294 -0.1392 -0.1526 -0.1626 -0.0377 -0.0780 -0.1265 -0.1991 -0.0818 -0.1022 -0.1111 -0.0644 -0.0757 0.1897 0.2616 -0.0899 -0.0764 -0.2597 0.3183 -0.0266 -0.0876 -0.1712 -0.0685 0.3940 -0.2580 0.0825 0.0593 0.0657 0.0898 0.0699 0.0756 -0.0287 0.0769 0.0820 0.0246 0.0577 0.0581 0.0833 0.0996 0.0546 0.0354 0.0897 0.1024 0.0533 0.0518 0.0514 0.0470 0.0833 0.0730 0.0726 0.1345 0.1344 0.1364 0.1338 0.1048 0.1019 0.1135
va: 2.1191 2.1506 2.1552 2.1654 3.8719 3.8879 3.9762 3.8690 3.7947 3.9075 3.8930 3.8967 3.8511 3.9032 3.6681 3.8848 3.7651 3.9990 3.6916 3.6960 3.9560 4.0936 3.8742 3.9751 3.9447 3.8918 4.0682 3.9159 1.0095 1.0093 1.0165 1.0224 1.0084 1.0063 1.0565 1.0116 1.0109 1.0514 1.0129 1.0079 1.0114 1.0144 1.0120 1.0157 1.0182 1.0186 1.0115 1.0103 1.0077 1.0076 1.0060 1.0035 1.0030 1.0237 1.0211 1.0016 0.9997 1.0136 1.0058 1.0046
dispcorr: -0.034209337 hartree
energy: -1234.905178850539
dipole: -26.82508 26.89361 0.06853 1.42085 -1.44557 -0.02472 36.12472 -36.41292 -0.28819
magnitude: 0.29726 au
magnitude: 0.75557 debye
