program: Orca
programVersion: 5.0.2
elementType: O O O O C C C C C C C C C C C C C C C C C C C C C C C C H H H H H H H H H H H H H H H H H H H H H H H H H H H H H H H H
charge: 0
multiplicity: 1
keywords: wb97x-d3
keywords: def2-TZVPP
keywords: def2/J RIJCOSX
keywords: DEFGRID2
keywords: scfconv7
keywords: smallprint printgap noloewdin
keywords: NOSOSCF
formula: C24H32O4
InChI: InChI=1/C24H32O4/c1-3-4-5-6-7-8-9-10-11-12-17-21-22(26)19-15-13-14-16-20(19)23(27)24(21)28-18(2)25/h13-16H,3-12,17H2,1-2H3
60 atoms
O  2.727507 1.100446 0.42013
O  0.323163 -0.712849 -3.171195
O  1.082801 3.199344 0.325244
O  1.378528 0.895792 2.200696
C  1.129647 -3.625717 2.806059
C  0.094807 -2.66147 3.387935
C  1.280994 -3.649086 1.287178
C  -1.360979 -2.952131 3.00713
C  1.710462 -2.315372 0.688823
C  -1.879352 -2.330368 1.708748
C  1.903227 -2.381823 -0.819041
C  -1.972205 -0.80844 1.740173
C  2.472093 -1.094544 -1.429913
C  -2.546032 -0.204728 0.460887
C  1.549312 0.081247 -1.339446
C  -4.025506 -0.496672 0.23686
C  1.680323 1.071958 -0.44618
C  0.443979 0.151466 -2.333153
C  -0.506207 1.291463 -2.272458
C  -0.335911 2.310237 -1.337513
C  -4.575732 0.168958 -1.015694
C  0.815733 2.282147 -0.412903
C  -1.573727 1.33962 -3.159747
C  -1.233773 3.36921 -1.287763
C  -2.468981 2.394029 -3.104772
C  -2.301221 3.406425 -2.168535
C  2.458115 1.132654 1.754974
C  3.691104 1.477945 2.527683
H  0.890821 -4.638064 3.147628
H  2.104391 -3.387861 3.245071
H  0.358354 -1.628168 3.148556
H  0.180645 -2.72787 4.475832
H  0.351253 -3.983095 0.817829
H  2.02612 -4.408476 1.027994
H  -1.502897 -4.037354 2.96538
H  -2.010603 -2.6062 3.817082
H  0.975021 -1.544499 0.930815
H  2.647013 -1.99951 1.163421
H  -1.259957 -2.629867 0.858392
H  -2.869661 -2.750504 1.511423
H  0.959753 -2.637919 -1.30674
H  2.59616 -3.192656 -1.061729
H  -0.983711 -0.378372 1.916337
H  -2.587207 -0.499147 2.593059
H  2.691974 -1.274782 -2.483362
H  3.420166 -0.857841 -0.945849
H  -2.401563 0.880105 0.479638
H  -1.972277 -0.564728 -0.401055
H  -4.591775 -0.158374 1.110397
H  -4.190943 -1.575073 0.171302
H  -4.05289 -0.178856 -1.908178
H  -5.63703 -0.042405 -1.150294
H  -4.454879 1.252609 -0.972903
H  -1.699345 0.547924 -3.88567
H  -1.091045 4.155684 -0.559233
H  -3.304211 2.425724 -3.791484
H  -3.004228 4.227708 -2.128646
H  3.925219 2.532565 2.377122
H  4.549624 0.901846 2.186045
H  3.52906 1.301413 3.586427
totalener: -1234.86968858 hartree
nucrepener: 2827.23974962 hartree
electener: -4062.10943820 hartree
oneelecener: -7300.43483357 hartree
twoeener: 3238.32539537 hartree
kineticenergy: 1229.34348965 hartree
xcener: -121.325226670179 hartree
chargesum: -0.0000000
charge: -0.284410 -0.329887 -0.323174 -0.333459 -0.143850 -0.130013 -0.132412 -0.154845 -0.092194 -0.141684 -0.155683 -0.095042 -0.102971 -0.138949 -0.117109 -0.072829 0.220587 0.373034 -0.133981 -0.106214 -0.273131 0.318486 -0.096281 -0.063750 -0.128599 -0.091827 0.387697 -0.251102 0.069873 0.065063 0.068782 0.076259 0.069993 0.075013 0.071021 0.073146 0.015725 0.059023 0.052142 0.082130 0.087887 0.070762 0.071836 0.066735 0.105845 0.092995 0.077002 0.037936 0.054553 0.053881 0.072216 0.092123 0.069826 0.135357 0.135323 0.135354 0.134737 0.114471 0.101396 0.105187
qa: -0.2844 -0.3299 -0.3232 -0.3335 -0.1439 -0.1300 -0.1324 -0.1548 -0.0922 -0.1417 -0.1557 -0.0950 -0.1030 -0.1389 -0.1171 -0.0728 0.2206 0.3730 -0.1340 -0.1062 -0.2731 0.3185 -0.0963 -0.0638 -0.1286 -0.0918 0.3877 -0.2511 0.0699 0.0651 0.0688 0.0763 0.0700 0.0750 0.0710 0.0731 0.0157 0.0590 0.0521 0.0821 0.0879 0.0708 0.0718 0.0667 0.1058 0.0930 0.0770 0.0379 0.0546 0.0539 0.0722 0.0921 0.0698 0.1354 0.1353 0.1354 0.1347 0.1145 0.1014 0.1052
va: 2.1103 2.1489 2.1586 2.1572 3.9054 3.8570 3.8969 3.9331 3.8365 3.8769 3.9022 3.8507 3.8445 3.9269 3.7127 3.8804 3.7128 3.9278 3.6993 3.6891 3.9576 4.0962 3.9113 3.9313 3.9294 3.9004 4.0553 3.9131 1.0108 1.0103 1.0178 1.0071 1.0056 1.0105 1.0083 1.0065 1.0261 1.0143 1.0088 1.0138 1.0174 1.0144 1.0332 1.0155 1.0198 1.0206 1.0042 1.0090 1.0088 1.0089 1.0019 1.0080 1.0027 1.0273 1.0214 1.0003 0.9991 1.0043 1.0057 1.0137
dispcorr: -0.037244899 hartree
energy: -1234.906933479464
dipole: -15.70286 15.97342 0.27056 -28.95404 29.26957 0.31554 19.69682 -19.85622 -0.15940
magnitude: 0.44517 au
magnitude: 1.13152 debye
