program: Orca
programVersion: 5.0.2
elementType: O O O O C C C C C C C C C C C C C C C C C C C C C C C C H H H H H H H H H H H H H H H H H H H H H H H H H H H H H H H H
charge: 0
multiplicity: 1
keywords: wb97x-d3
keywords: def2-TZVPP
keywords: def2/J RIJCOSX
keywords: DEFGRID2
keywords: scfconv7
keywords: smallprint printgap noloewdin
keywords: NOSOSCF
formula: C24H32O4
InChI: InChI=1/C24H32O4/c1-3-4-5-6-7-8-9-10-11-12-17-21-22(26)19-15-13-14-16-20(19)23(27)24(21)28-18(2)25/h13-16H,3-12,17H2,1-2H3
60 atoms
O  1.891468 -2.613192 -1.196348
O  1.480661 -0.059478 2.712796
O  -0.736774 -2.98487 -1.10724
O  1.128744 -1.211378 -2.767491
C  2.472228 3.517522 0.438773
C  1.009113 3.501558 0.883084
C  3.22827 2.192524 0.572145
C  0.048925 2.70082 0.01118
C  3.067224 1.234783 -0.605279
C  -1.410676 2.8911 0.402429
C  3.796679 -0.092233 -0.429712
C  -2.368659 2.082397 -0.462131
C  3.273867 -0.98535 0.707754
C  -3.829004 2.258389 -0.06491
C  1.79005 -1.216701 0.690426
C  -4.808235 1.427422 -0.889797
C  1.178866 -1.958522 -0.241676
C  0.962384 -0.633623 1.78229
C  -0.516579 -0.763137 1.708241
C  -1.11784 -1.535214 0.716472
C  -4.907076 1.855676 -2.34821
C  -0.282415 -2.227095 -0.283827
C  -1.306472 -0.114865 2.649378
C  -2.500424 -1.662817 0.670644
C  -2.684895 -0.233295 2.593111
C  -3.281902 -1.007656 1.606516
C  1.671018 -2.235264 -2.488608
C  2.202793 -3.260875 -3.437208
H  2.988242 4.266294 1.045522
H  2.537805 3.87902 -0.593612
H  0.655661 4.537481 0.918514
H  0.953359 3.132919 1.913089
H  2.931837 1.712118 1.507926
H  4.296685 2.406934 0.679113
H  0.183915 2.983717 -1.038631
H  0.28614 1.634984 0.063068
H  2.015697 1.037389 -0.820236
H  3.454971 1.721278 -1.505237
H  -1.544141 2.609139 1.452738
H  -1.669714 3.953947 0.339808
H  4.857203 0.093984 -0.234794
H  3.761146 -0.640376 -1.372203
H  -2.10408 1.021671 -0.39808
H  -2.225789 2.364988 -1.50971
H  3.544262 -0.553897 1.67016
H  3.782839 -1.950568 0.652116
H  -3.937829 1.99282 0.99146
H  -4.10403 3.316725 -0.137339
H  -5.800215 1.490062 -0.433892
H  -4.518005 0.373193 -0.838196
H  -5.646536 1.261816 -2.88607
H  -5.204246 2.90279 -2.430529
H  -3.958301 1.741691 -2.872692
H  -0.835767 0.480792 3.419404
H  -2.953658 -2.268283 -0.102397
H  -3.297725 0.279816 3.32225
H  -4.35928 -1.095122 1.565168
H  3.170212 -3.64467 -3.117722
H  2.282284 -2.841315 -4.43557
H  1.509541 -4.103099 -3.465776
totalener: -1234.86878589 hartree
nucrepener: 2821.56536014 hartree
electener: -4056.43414603 hartree
oneelecener: -7288.91982956 hartree
twoeener: 3232.48568353 hartree
kineticenergy: 1229.35211524 hartree
xcener: -121.326286464762 hartree
chargesum: -0.0000000
charge: -0.282804 -0.332656 -0.326216 -0.315404 -0.140088 -0.114289 -0.146703 -0.072435 -0.124137 -0.164167 -0.165768 -0.114603 -0.177656 -0.124781 -0.059938 -0.109549 0.197198 0.301395 -0.090680 -0.058217 -0.254303 0.335316 -0.120067 -0.070722 -0.105313 -0.127765 0.352624 -0.249053 0.079360 0.056089 0.066449 0.060280 0.078897 0.072782 0.080547 -0.005173 0.087534 0.074316 0.058703 0.072492 0.081302 0.086870 0.051929 0.079592 0.113185 0.101130 0.067892 0.073661 0.068791 0.042157 0.083676 0.074327 0.079655 0.138487 0.135696 0.137658 0.140447 0.101633 0.104784 0.115635
qa: -0.2828 -0.3327 -0.3262 -0.3154 -0.1401 -0.1143 -0.1467 -0.0724 -0.1241 -0.1642 -0.1658 -0.1146 -0.1777 -0.1248 -0.0599 -0.1095 0.1972 0.3014 -0.0907 -0.0582 -0.2543 0.3353 -0.1201 -0.0707 -0.1053 -0.1278 0.3526 -0.2491 0.0794 0.0561 0.0664 0.0603 0.0789 0.0728 0.0805 -0.0052 0.0875 0.0743 0.0587 0.0725 0.0813 0.0869 0.0519 0.0796 0.1132 0.1011 0.0679 0.0737 0.0688 0.0422 0.0837 0.0743 0.0797 0.1385 0.1357 0.1377 0.1404 0.1016 0.1048 0.1156
va: 2.1171 2.1337 2.1553 2.1751 3.9411 3.8911 3.8625 3.8536 3.8620 3.9197 3.9178 3.8288 3.8488 3.8528 3.6482 3.8945 3.8045 3.9230 3.6882 3.6457 3.9408 4.0807 3.9140 3.8908 3.8897 3.8929 4.0973 3.9121 1.0039 1.0122 1.0111 1.0130 1.0187 1.0105 1.0127 1.0378 1.0052 1.0128 1.0097 1.0155 1.0125 1.0084 1.0133 1.0177 1.0154 1.0103 1.0125 1.0125 1.0058 1.0121 1.0064 1.0029 1.0019 1.0247 1.0248 0.9999 0.9964 1.0067 1.0134 1.0036
dispcorr: -0.037510556 hartree
energy: -1234.906296443633
dipole: -8.29191 8.23419 -0.05772 32.40765 -32.76317 -0.35552 -8.44702 8.54604 0.09902
magnitude: 0.37354 au
magnitude: 0.94946 debye
