program: Orca
programVersion: 5.0.2
elementType: O O O O C C C C C C C C C C C C C C C C C C C C C C C C H H H H H H H H H H H H H H H H H H H H H H H H H H H H H H H H
charge: 0
multiplicity: 1
keywords: wb97x-d3
keywords: def2-TZVPP
keywords: def2/J RIJCOSX
keywords: DEFGRID2
keywords: scfconv7
keywords: smallprint printgap noloewdin
keywords: NOSOSCF
formula: C24H32O4
InChI: InChI=1/C24H32O4/c1-3-4-5-6-7-8-9-10-11-12-17-21-22(26)19-15-13-14-16-20(19)23(27)24(21)28-18(2)25/h13-16H,3-12,17H2,1-2H3
60 atoms
O  1.589341 -1.851419 -2.27995
O  1.944887 2.319766 -0.173655
O  -0.651851 -0.981588 -3.412585
O  0.053237 -2.875577 -1.012027
C  1.736013 0.042959 4.468001
C  0.310311 0.571436 4.332161
C  2.208179 -0.859811 3.329506
C  -0.760702 -0.509637 4.416852
C  2.205907 -0.170252 1.970102
C  -2.184356 0.032458 4.309542
C  2.879146 -1.000113 0.884938
C  -2.561337 0.604772 2.944113
C  3.084941 -0.258546 -0.443414
C  -2.58886 -0.429422 1.825324
C  1.806508 0.167799 -1.097496
C  -3.094881 0.12986 0.501661
C  1.115856 -0.62721 -1.924042
C  1.298564 1.540905 -0.836144
C  -0.018764 1.933863 -1.401319
C  -0.70435 1.086764 -2.270257
C  -3.231051 -0.941578 -0.569279
C  -0.140717 -0.234863 -2.612513
C  -0.561334 3.170348 -1.072906
C  -1.917777 1.482652 -2.818349
C  -1.781238 3.55253 -1.605238
C  -2.456985 2.711788 -2.480486
C  0.882115 -2.939345 -1.866176
C  1.311084 -4.158683 -2.617405
H  1.826302 -0.498997 5.414722
H  2.421794 0.892735 4.542619
H  0.213447 1.129922 3.397039
H  0.130813 1.301873 5.127646
H  1.601564 -1.769368 3.283795
H  3.225282 -1.194685 3.557249
H  -0.597085 -1.270845 3.648506
H  -0.653258 -1.031216 5.373367
H  1.176176 0.05061 1.673084
H  2.710923 0.796887 2.05531
H  -2.890028 -0.766737 4.557292
H  -2.326234 0.803905 5.073313
H  2.305255 -1.914807 0.713927
H  3.865719 -1.3185 1.234948
H  -1.885647 1.422039 2.672489
H  -3.553673 1.059946 3.023534
H  3.640234 -0.902977 -1.12629
H  3.702778 0.622563 -0.267013
H  -1.592522 -0.855581 1.669801
H  -3.22664 -1.267341 2.129494
H  -2.41906 0.918381 0.156086
H  -4.063469 0.614884 0.659905
H  -2.281407 -1.442434 -0.758642
H  -3.945581 -1.708804 -0.265383
H  -3.581092 -0.524971 -1.513951
H  -0.024722 3.825617 -0.400673
H  -2.43522 0.820464 -3.498896
H  -2.206501 4.511393 -1.340652
H  -3.40719 3.016085 -2.89832
H  0.936822 -4.096084 -3.639943
H  0.905991 -5.049722 -2.147899
H  2.39618 -4.231329 -2.67151
totalener: -1234.87235255 hartree
nucrepener: 2798.69697970 hartree
electener: -4033.56933225 hartree
oneelecener: -7243.35960698 hartree
twoeener: 3209.79027473 hartree
kineticenergy: 1229.35362078 hartree
xcener: -121.324835318819 hartree
chargesum: 0.0000000
charge: -0.286149 -0.326088 -0.321461 -0.332206 -0.151250 -0.130211 -0.139725 -0.145406 -0.102094 -0.137950 -0.147370 -0.121493 -0.126731 -0.112362 -0.062670 -0.058845 0.227817 0.289748 -0.076338 -0.064144 -0.273727 0.249099 -0.086650 -0.108245 -0.094216 -0.090867 0.375981 -0.249523 0.070022 0.073197 0.065193 0.074422 0.072379 0.067580 0.069147 0.072531 0.037388 0.081907 0.070236 0.068228 0.075662 0.070502 0.061234 0.067215 0.098166 0.103646 0.054431 0.060519 0.013195 0.056566 0.090015 0.084636 0.081301 0.135362 0.140635 0.133863 0.133415 0.114030 0.104492 0.101959
qa: -0.2861 -0.3261 -0.3215 -0.3322 -0.1513 -0.1302 -0.1397 -0.1454 -0.1021 -0.1380 -0.1474 -0.1215 -0.1267 -0.1124 -0.0627 -0.0588 0.2278 0.2897 -0.0763 -0.0641 -0.2737 0.2491 -0.0866 -0.1082 -0.0942 -0.0909 0.3760 -0.2495 0.0700 0.0732 0.0652 0.0744 0.0724 0.0676 0.0691 0.0725 0.0374 0.0819 0.0702 0.0682 0.0757 0.0705 0.0612 0.0672 0.0982 0.1036 0.0544 0.0605 0.0132 0.0566 0.0900 0.0846 0.0813 0.1354 0.1406 0.1339 0.1334 0.1140 0.1045 0.1020
va: 2.1186 2.1452 2.1504 2.1502 3.9271 3.8610 3.8859 3.8724 3.8380 3.9226 3.8995 3.8676 3.8433 3.8739 3.6842 3.8743 3.7597 3.9770 3.7277 3.6293 3.9505 4.1009 3.9620 3.9167 3.9519 3.9466 4.0704 3.9117 1.0116 1.0087 1.0049 1.0125 1.0052 1.0141 1.0027 1.0129 1.0110 1.0167 1.0090 1.0106 1.0211 1.0152 1.0072 1.0133 1.0156 1.0244 1.0129 1.0143 1.0171 1.0131 1.0056 1.0094 1.0051 1.0246 1.0226 1.0002 1.0008 1.0041 1.0137 1.0061
dispcorr: -0.035316617 hartree
energy: -1234.907669169715
dipole: -9.27713 9.41354 0.13641 -7.33519 7.42023 0.08504 37.35122 -37.72866 -0.37744
magnitude: 0.41024 au
magnitude: 1.04275 debye
