program: Orca
programVersion: 5.0.2
elementType: O O O O C C C C C C C C C C C C C C C C C C C C C C C C H H H H H H H H H H H H H H H H H H H H H H H H H H H H H H H H
charge: 0
multiplicity: 1
keywords: wb97x-d3
keywords: def2-TZVPP
keywords: def2/J RIJCOSX
keywords: DEFGRID2
keywords: scfconv7
keywords: smallprint printgap noloewdin
keywords: NOSOSCF
formula: C24H32O4
InChI: InChI=1/C24H32O4/c1-3-4-5-6-7-8-9-10-11-12-17-21-22(26)19-15-13-14-16-20(19)23(27)24(21)28-18(2)25/h13-16H,3-12,17H2,1-2H3
60 atoms
O  1.613333 -1.804086 -1.767513
O  2.053477 2.674857 -0.437211
O  -0.805238 -1.191374 -2.679104
O  0.201829 -2.661722 -0.249536
C  1.657917 -0.315936 3.711194
C  0.419695 -1.20536 3.783839
C  2.876811 -1.050847 3.150839
C  -0.846833 -0.467439 4.215004
C  2.879976 -1.119732 1.623294
C  -1.526637 0.35922 3.124169
C  3.441986 0.146519 0.991788
C  -2.144049 -0.486502 2.012728
C  3.314779 0.189631 -0.535752
C  -3.127961 0.283614 1.140169
C  1.913548 0.407323 -1.0148
C  -3.787579 -0.586979 0.075889
C  1.14436 -0.545201 -1.559615
C  1.37109 1.788924 -0.898966
C  -0.014895 2.059571 -1.359406
C  -0.772549 1.056385 -1.960539
C  -4.937986 0.110814 -0.6352
C  -0.21454 -0.302188 -2.113469
C  -0.546473 3.335368 -1.217437
C  -2.047596 1.334656 -2.435578
C  -1.822902 3.606033 -1.681362
C  -2.569856 2.609112 -2.295266
C  0.955345 -2.831075 -1.157527
C  1.331452 -4.137449 -1.778455
H  1.877517 0.056084 4.716175
H  1.453211 0.57362 3.105445
H  0.624414 -2.008923 4.498111
H  0.252958 -1.704616 2.82423
H  2.902094 -2.061261 3.56929
H  3.798087 -0.566702 3.489156
H  -1.574009 -1.194258 4.590283
H  -0.608044 0.178524 5.066189
H  3.472396 -1.975142 1.284284
H  1.861267 -1.300149 1.2712
H  -2.316574 0.956419 3.591253
H  -0.82607 1.083281 2.695117
H  4.504026 0.224427 1.240933
H  2.972668 1.032401 1.42422
H  -2.672457 -1.333572 2.465267
H  -1.364412 -0.927012 1.384501
H  3.715096 -0.731783 -0.960363
H  3.931837 1.005451 -0.916956
H  -3.903729 0.720755 1.779484
H  -2.624148 1.129856 0.65891
H  -4.15928 -1.50533 0.540493
H  -3.035813 -0.908867 -0.650207
H  -4.617578 1.055149 -1.077882
H  -5.353396 -0.506413 -1.432747
H  -5.748202 0.339876 0.059092
H  0.045601 4.110283 -0.750435
H  -2.624814 0.551421 -2.907622
H  -2.235885 4.599548 -1.569395
H  -3.563368 2.826886 -2.664017
H  0.831639 -4.224503 -2.744445
H  1.011788 -4.958465 -1.144045
H  2.403355 -4.204005 -1.957744
totalener: -1234.87098140 hartree
nucrepener: 2819.53036374 hartree
electener: -4054.40134514 hartree
oneelecener: -7285.02475879 hartree
twoeener: 3230.62341365 hartree
kineticenergy: 1229.33502038 hartree
xcener: -121.320271169905 hartree
chargesum: -0.0000000
charge: -0.286399 -0.329461 -0.328289 -0.332497 -0.121722 -0.146459 -0.153585 -0.145198 -0.063934 -0.110634 -0.190027 -0.090220 -0.092131 -0.114446 -0.120337 -0.073053 0.216828 0.346112 -0.125826 -0.084238 -0.279438 0.319792 -0.086506 -0.111596 -0.092592 -0.107651 0.388825 -0.253661 0.070274 0.058703 0.070315 0.077614 0.069775 0.071404 0.069962 0.066960 0.071675 0.029022 0.063255 0.056620 0.071038 0.095010 0.052757 0.041480 0.088017 0.105060 0.060920 0.038833 0.063977 0.059230 0.060900 0.090693 0.081654 0.137380 0.149157 0.134434 0.141290 0.114229 0.105410 0.101296
qa: -0.2864 -0.3295 -0.3283 -0.3325 -0.1217 -0.1465 -0.1536 -0.1452 -0.0639 -0.1106 -0.1900 -0.0902 -0.0921 -0.1144 -0.1203 -0.0731 0.2168 0.3461 -0.1258 -0.0842 -0.2794 0.3198 -0.0865 -0.1116 -0.0926 -0.1077 0.3888 -0.2537 0.0703 0.0587 0.0703 0.0776 0.0698 0.0714 0.0700 0.0670 0.0717 0.0290 0.0633 0.0566 0.0710 0.0950 0.0528 0.0415 0.0880 0.1051 0.0609 0.0388 0.0640 0.0592 0.0609 0.0907 0.0817 0.1374 0.1492 0.1344 0.1413 0.1142 0.1054 0.1013
va: 2.1142 2.1507 2.1430 2.1574 3.8683 3.8719 3.9447 3.9301 3.8282 3.8741 3.9054 3.8815 3.8301 3.8827 3.7214 3.8500 3.7298 3.9809 3.7966 3.6662 3.9281 4.0667 3.9887 3.8988 3.9578 3.9202 4.0634 3.9169 1.0132 1.0128 1.0120 1.0081 1.0083 1.0068 1.0074 1.0102 1.0105 1.0369 1.0119 1.0112 1.0157 1.0139 1.0161 1.0225 1.0217 1.0166 1.0144 1.0106 1.0141 1.0129 1.0060 1.0051 1.0072 1.0242 1.0162 1.0002 0.9971 1.0042 1.0134 1.0065
dispcorr: -0.035612711 hartree
energy: -1234.906594106923
dipole: -10.86248 10.99171 0.12923 -8.60104 8.58745 -0.01359 30.40532 -30.92443 -0.51911
magnitude: 0.53513 au
magnitude: 1.36019 debye
