program: Orca
programVersion: 5.0.2
elementType: O O O O C C C C C C C C C C C C C C C C C C C C C C C C H H H H H H H H H H H H H H H H H H H H H H H H H H H H H H H H
charge: 0
multiplicity: 1
keywords: wb97x-d3
keywords: def2-TZVPP
keywords: def2/J RIJCOSX
keywords: DEFGRID2
keywords: scfconv7
keywords: smallprint printgap noloewdin
keywords: NOSOSCF
formula: C24H32O4
InChI: InChI=1/C24H32O4/c1-3-4-5-6-7-8-9-10-11-12-17-21-22(26)19-15-13-14-16-20(19)23(27)24(21)28-18(2)25/h13-16H,3-12,17H2,1-2H3
60 atoms
O  -0.077727 1.792162 1.368311
O  3.492361 1.990453 -1.666493
O  -1.675364 2.541597 -0.6309
O  -1.177461 -0.061198 0.758689
C  1.787925 -3.464471 1.785996
C  0.475812 -3.569448 1.016724
C  2.762543 -2.424759 1.239654
C  -0.44497 -4.649607 1.57229
C  2.224098 -0.998595 1.269545
C  -1.717201 -4.867005 0.7563
C  3.283198 0.039952 0.930184
C  -2.636444 -3.654377 0.628311
C  2.769779 1.48511 0.981024
C  -3.182592 -3.134345 1.952288
C  1.771107 1.806605 -0.087429
C  -4.219781 -2.032501 1.769872
C  0.452559 1.918349 0.121475
C  2.301126 2.033514 -1.459453
C  1.344492 2.299829 -2.564444
C  -0.018817 2.43288 -2.307997
C  -4.829557 -1.561377 3.082274
C  -0.526891 2.314529 -0.926287
C  1.817688 2.429393 -3.864327
C  -0.903084 2.695073 -3.347031
C  0.93263 2.68266 -4.898693
C  -0.426056 2.815157 -4.640961
C  -1.004014 0.811938 1.553305
C  -1.721147 0.998001 2.850967
H  2.279359 -4.442573 1.788563
H  1.573191 -3.235888 2.836049
H  0.69055 -3.782314 -0.037167
H  -0.040306 -2.60652 1.029219
H  3.040228 -2.685483 0.212875
H  3.68904 -2.471493 1.821163
H  0.101589 -5.597147 1.61724
H  -0.700034 -4.409533 2.609696
H  1.384283 -0.909207 0.577204
H  1.821102 -0.787936 2.267569
H  -1.436448 -5.202279 -0.247278
H  -2.282782 -5.692815 1.200058
H  3.712256 -0.165466 -0.053055
H  4.110543 -0.041789 1.640766
H  -3.478976 -3.933044 -0.012849
H  -2.125686 -2.839704 0.107525
H  3.617689 2.162842 0.867575
H  2.338599 1.680822 1.96341
H  -3.625644 -3.963503 2.516477
H  -2.362712 -2.75298 2.570608
H  -5.016507 -2.392226 1.111592
H  -3.756084 -1.190641 1.248783
H  -5.352301 -2.374022 3.58968
H  -4.065267 -1.194473 3.771055
H  -5.546303 -0.754345 2.927357
H  2.876916 2.329717 -4.057556
H  -1.958403 2.799706 -3.13507
H  1.302422 2.779049 -5.910695
H  -1.11372 3.013878 -5.451941
H  -1.039372 1.281326 3.651093
H  -2.247429 0.086792 3.119031
H  -2.45076 1.801858 2.741055
totalener: -1234.87469371 hartree
nucrepener: 2695.05547801 hartree
electener: -3929.93017171 hartree
oneelecener: -7035.99989751 hartree
twoeener: 3106.06972580 hartree
kineticenergy: 1229.33716027 hartree
xcener: -121.319671555906 hartree
chargesum: 0.0000000
charge: -0.284357 -0.330128 -0.324734 -0.344281 -0.121182 -0.093037 -0.143152 -0.135574 -0.102133 -0.153284 -0.167897 -0.120423 -0.098463 -0.102494 -0.129509 -0.126302 0.226839 0.364289 -0.133742 -0.090412 -0.259767 0.307884 -0.093507 -0.073030 -0.103041 -0.106934 0.400793 -0.249224 0.067739 0.057320 0.059102 0.048073 0.064437 0.066942 0.069007 0.062354 0.070447 0.050586 0.068835 0.069464 0.087311 0.069934 0.067172 0.075760 0.107459 0.091494 0.062341 0.045366 0.061520 0.070657 0.080260 0.061709 0.089387 0.137652 0.136517 0.134547 0.134547 0.111404 0.087134 0.120323
qa: -0.2844 -0.3301 -0.3247 -0.3443 -0.1212 -0.0930 -0.1432 -0.1356 -0.1021 -0.1533 -0.1679 -0.1204 -0.0985 -0.1025 -0.1295 -0.1263 0.2268 0.3643 -0.1337 -0.0904 -0.2598 0.3079 -0.0935 -0.0730 -0.1030 -0.1069 0.4008 -0.2492 0.0677 0.0573 0.0591 0.0481 0.0644 0.0669 0.0690 0.0624 0.0704 0.0506 0.0688 0.0695 0.0873 0.0699 0.0672 0.0758 0.1075 0.0915 0.0623 0.0454 0.0615 0.0707 0.0803 0.0617 0.0894 0.1377 0.1365 0.1345 0.1345 0.1114 0.0871 0.1203
va: 2.1275 2.1505 2.1549 2.1073 3.8809 3.8605 3.9314 3.8866 3.8209 3.9262 3.9226 3.8611 3.8408 3.8430 3.7446 3.8804 3.6993 3.9873 3.8245 3.7902 3.9339 4.1181 3.9853 3.9624 3.9561 3.9575 4.0194 3.9203 1.0152 1.0105 1.0130 1.0094 1.0108 1.0132 1.0132 1.0033 1.0188 1.0094 1.0096 1.0094 1.0165 1.0147 1.0123 1.0116 1.0186 1.0211 1.0135 1.0071 1.0130 1.0161 1.0040 1.0003 1.0054 1.0251 1.0226 1.0005 1.0005 1.0120 1.0137 1.0048
dispcorr: -0.031670746 hartree
energy: -1234.906364453469
dipole: -14.77112 14.75879 -0.01233 -43.45962 43.90029 0.44067 27.45820 -27.56939 -0.11119
magnitude: 0.45464 au
magnitude: 1.15561 debye
