program: Orca
programVersion: 5.0.2
elementType: O O O O C C C C C C C C C C C C C C C C C C C C C C C C H H H H H H H H H H H H H H H H H H H H H H H H H H H H H H H H
charge: 0
multiplicity: 1
keywords: wb97x-d3
keywords: def2-TZVPP
keywords: def2/J RIJCOSX
keywords: DEFGRID2
keywords: scfconv7
keywords: smallprint printgap noloewdin
keywords: NOSOSCF
formula: C24H32O4
InChI: InChI=1/C24H32O4/c1-3-4-5-6-7-8-9-10-11-12-17-21-22(26)19-15-13-14-16-20(19)23(27)24(21)28-18(2)25/h13-16H,3-12,17H2,1-2H3
60 atoms
O  0.972036 -1.329739 -1.570905
O  3.310887 2.711797 -1.130271
O  -0.88967 0.030282 -2.920696
O  -0.76867 -1.103581 -0.182278
C  1.421916 -1.172101 4.026764
C  -0.048595 -0.991934 3.67208
C  2.371613 -0.290951 3.219172
C  -0.981129 -1.85211 4.518093
C  2.279699 -0.503041 1.710887
C  -2.442662 -1.787282 4.07847
C  3.39828 0.194529 0.950814
C  -2.70155 -2.439145 2.72447
C  3.346616 -0.021678 -0.567599
C  -4.147181 -2.331992 2.258219
C  2.191332 0.655391 -1.2383
C  -4.36335 -2.930377 0.873205
C  1.092869 0.022087 -1.672335
C  2.303377 2.12448 -1.452404
C  1.15631 2.852404 -2.053265
C  0.03831 2.159943 -2.512855
C  -5.800687 -2.809787 0.387898
C  -0.012292 0.687384 -2.414591
C  1.205964 4.23619 -2.169224
C  -1.023577 2.847762 -3.086529
C  0.141918 4.919609 -2.732907
C  -0.972185 4.227137 -3.189845
C  -0.097497 -1.805001 -0.875649
C  -0.270276 -3.272104 -1.101162
H  1.698983 -2.222255 3.880894
H  1.567407 -0.970327 5.09269
H  -0.196019 -1.222312 2.61534
H  -0.326701 0.061815 3.787718
H  3.397438 -0.48578 3.548463
H  2.178867 0.762671 3.446951
H  -0.643373 -2.894387 4.488089
H  -0.901102 -1.542729 5.564831
H  2.313039 -1.577728 1.494135
H  1.311596 -0.149268 1.34942
H  -3.069676 -2.270306 4.834334
H  -2.76431 -0.740508 4.04603
H  4.362602 -0.181496 1.304413
H  3.395704 1.264085 1.173192
H  -2.413584 -3.495894 2.775765
H  -2.062484 -1.987002 1.962677
H  3.323949 -1.091323 -0.779251
H  4.266967 0.366821 -1.007033
H  -4.810826 -2.821587 2.979748
H  -4.44436 -1.277654 2.243114
H  -4.068688 -3.984871 0.884624
H  -3.692163 -2.434993 0.164768
H  -5.928314 -3.242361 -0.604836
H  -6.491047 -3.321046 1.061119
H  -6.111732 -1.765175 0.332787
H  2.078455 4.768657 -1.816699
H  -1.883409 2.298231 -3.44449
H  0.180179 5.997365 -2.8176
H  -1.800909 4.76527 -3.629885
H  -0.663901 -3.435314 -2.105503
H  -0.972425 -3.678357 -0.378781
H  0.678816 -3.801673 -1.031951
totalener: -1234.87537614 hartree
nucrepener: 2667.16621769 hartree
electener: -3902.04159383 hartree
oneelecener: -6980.24390717 hartree
twoeener: 3078.20231334 hartree
kineticenergy: 1229.33852410 hartree
xcener: -121.318692819123 hartree
chargesum: -0.0000000
charge: -0.284593 -0.329973 -0.324243 -0.339561 -0.126807 -0.085487 -0.144002 -0.135750 -0.103038 -0.128185 -0.165650 -0.071974 -0.096407 -0.112159 -0.128979 -0.072127 0.230122 0.359248 -0.132952 -0.086452 -0.262409 0.303541 -0.093140 -0.074302 -0.103842 -0.106930 0.395130 -0.251415 0.056502 0.067938 0.048707 0.057043 0.066676 0.065862 0.053121 0.071031 0.053268 0.070466 0.068231 0.056142 0.069405 0.086252 0.047320 0.039792 0.091025 0.106874 0.052314 0.051577 0.044901 0.052945 0.081943 0.070843 0.073307 0.138181 0.137216 0.134412 0.134186 0.118131 0.099956 0.106770
qa: -0.2846 -0.3300 -0.3242 -0.3396 -0.1268 -0.0855 -0.1440 -0.1357 -0.1030 -0.1282 -0.1656 -0.0720 -0.0964 -0.1122 -0.1290 -0.0721 0.2301 0.3592 -0.1330 -0.0865 -0.2624 0.3035 -0.0931 -0.0743 -0.1038 -0.1069 0.3951 -0.2514 0.0565 0.0679 0.0487 0.0570 0.0667 0.0659 0.0531 0.0710 0.0533 0.0705 0.0682 0.0561 0.0694 0.0863 0.0473 0.0398 0.0910 0.1069 0.0523 0.0516 0.0449 0.0529 0.0819 0.0708 0.0733 0.1382 0.1372 0.1344 0.1342 0.1181 0.1000 0.1068
va: 2.1234 2.1504 2.1555 2.1126 3.8861 3.8642 3.9270 3.9257 3.8207 3.9484 3.9262 3.8667 3.8396 3.8991 3.7535 3.8799 3.6999 3.9927 3.8224 3.7830 3.9667 4.1147 3.9840 3.9627 3.9561 3.9573 4.0287 3.9294 1.0105 1.0149 1.0090 1.0130 1.0132 1.0106 1.0104 1.0122 1.0086 1.0180 1.0110 1.0095 1.0145 1.0164 1.0092 1.0290 1.0216 1.0190 1.0116 1.0104 1.0045 1.0155 1.0060 1.0027 1.0033 1.0247 1.0222 1.0004 1.0005 1.0043 1.0079 1.0085
dispcorr: -0.030170243 hartree
energy: -1234.905546378619
dipole: -20.77583 20.92714 0.15132 -28.98261 29.02258 0.03997 39.61654 -40.01962 -0.40308
magnitude: 0.43240 au
magnitude: 1.09906 debye
