program: Orca
programVersion: 5.0.2
elementType: O O O O C C C C C C C C C C C C C C C C C C C C C C C C H H H H H H H H H H H H H H H H H H H H H H H H H H H H H H H H
charge: 0
multiplicity: 1
keywords: wb97x-d3
keywords: def2-TZVPP
keywords: def2/J RIJCOSX
keywords: DEFGRID2
keywords: scfconv7
keywords: smallprint printgap noloewdin
keywords: NOSOSCF
formula: C24H32O4
InChI: InChI=1/C24H32O4/c1-3-4-5-6-7-8-9-10-11-12-17-21-22(26)19-15-13-14-16-20(19)23(27)24(21)28-18(2)25/h13-16H,3-12,17H2,1-2H3
60 atoms
O  3.254162 -1.352136 -2.385682
O  1.596126 2.101822 0.294551
O  0.99467 -1.163335 -3.802169
O  2.095327 -3.171909 -1.78283
C  0.934779 -0.195342 3.602098
C  -0.213814 0.334482 2.750522
C  2.289421 -0.137683 2.896836
C  -1.575949 0.242132 3.423689
C  2.4431 -1.191039 1.803093
C  -2.693081 0.816332 2.561344
C  3.686184 -1.034485 0.933567
C  -4.071568 0.724057 3.200978
C  3.676878 0.182548 -0.006883
C  -5.172978 1.320378 2.33421
C  2.447581 0.243023 -0.863243
C  -6.554865 1.247559 2.971305
C  2.263762 -0.536698 -1.936043
C  1.387263 1.227482 -0.515453
C  0.063224 1.105317 -1.176254
C  -0.105576 0.262412 -2.273033
C  -7.641576 1.864531 2.102777
C  1.035731 -0.530713 -2.774515
C  -1.011186 1.848115 -0.703619
C  -1.341994 0.169838 -2.898834
C  -2.248956 1.734426 -1.314368
C  -2.413438 0.900359 -2.412814
C  3.004966 -2.693042 -2.384969
C  4.021139 -3.415347 -3.209775
H  0.723902 -1.226505 3.907456
H  0.98413 0.386661 4.527229
H  -0.258044 -0.206159 1.799501
H  -0.007302 1.377791 2.491137
H  3.089227 -0.280276 3.630196
H  2.431487 0.866938 2.490063
H  -1.798232 -0.803995 3.66022
H  -1.549101 0.768632 4.38405
H  2.47464 -2.177814 2.273942
H  1.559136 -1.215179 1.158484
H  -2.469324 1.865682 2.336478
H  -2.704794 0.301129 1.594574
H  3.813771 -1.943394 0.342712
H  4.574909 -0.960975 1.567588
H  -4.05794 1.232458 4.171122
H  -4.304092 -0.324519 3.415467
H  4.564676 0.143193 -0.640852
H  3.749471 1.103549 0.569851
H  -4.932755 2.366599 2.112822
H  -5.191817 0.805989 1.366691
H  -6.531981 1.752127 3.941908
H  -6.802138 0.202935 3.182613
H  -7.714371 1.357172 1.139307
H  -8.620202 1.805566 2.579384
H  -7.436909 2.917674 1.902596
H  -0.875367 2.501887 0.146672
H  -1.459027 -0.480182 -3.755086
H  -3.08939 2.298461 -0.932183
H  -3.38079 0.819334 -2.889901
H  5.030851 -3.076179 -2.98479
H  3.835726 -3.210791 -4.264581
H  3.947017 -4.485144 -3.040758
totalener: -1234.87332418 hartree
nucrepener: 2675.88556764 hartree
electener: -3910.75889183 hartree
oneelecener: -6997.43737606 hartree
twoeener: 3086.67848423 hartree
kineticenergy: 1229.34704581 hartree
xcener: -121.320623941172 hartree
chargesum: -0.0000000
charge: -0.284809 -0.327960 -0.323750 -0.314178 -0.143549 -0.076651 -0.133646 -0.140069 -0.124724 -0.074982 -0.166127 -0.120920 -0.170554 -0.092871 -0.021505 -0.081438 0.207935 0.250075 -0.045574 -0.082131 -0.258173 0.304043 -0.117917 -0.077185 -0.104494 -0.101448 0.353062 -0.250788 0.058476 0.069627 0.043339 0.056905 0.073478 0.076183 0.056359 0.056176 0.080229 0.071534 0.048278 0.055819 0.088740 0.078817 0.053587 0.055112 0.098279 0.110281 0.047480 0.049195 0.052075 0.052969 0.070993 0.085242 0.071304 0.137802 0.135407 0.132663 0.134268 0.101844 0.113681 0.104187
qa: -0.2848 -0.3280 -0.3238 -0.3142 -0.1435 -0.0767 -0.1336 -0.1401 -0.1247 -0.0750 -0.1661 -0.1209 -0.1706 -0.0929 -0.0215 -0.0814 0.2079 0.2501 -0.0456 -0.0821 -0.2582 0.3040 -0.1179 -0.0772 -0.1045 -0.1014 0.3531 -0.2508 0.0585 0.0696 0.0433 0.0569 0.0735 0.0762 0.0564 0.0562 0.0802 0.0715 0.0483 0.0558 0.0887 0.0788 0.0536 0.0551 0.0983 0.1103 0.0475 0.0492 0.0521 0.0530 0.0710 0.0852 0.0713 0.1378 0.1354 0.1327 0.1343 0.1018 0.1137 0.1042
va: 2.1208 2.1405 2.1560 2.1753 3.9770 3.8632 3.8687 3.9443 3.8494 3.8811 3.9164 3.9306 3.8431 3.8797 3.6052 3.8960 3.7924 4.0187 3.6851 3.7761 3.9517 4.0994 3.9455 3.9686 3.9263 3.9625 4.1123 3.9091 1.0094 1.0107 1.0130 1.0141 1.0130 1.0194 1.0114 1.0126 1.0113 1.0181 1.0095 1.0056 1.0127 1.0128 1.0122 1.0123 1.0142 1.0181 1.0100 1.0103 1.0081 1.0081 1.0033 1.0067 1.0030 1.0207 1.0224 1.0020 0.9996 1.0057 1.0042 1.0140
dispcorr: -0.032365027 hartree
energy: -1234.905689210257
dipole: -30.34607 30.39754 0.05147 4.06909 -4.03320 0.03589 40.00178 -40.08856 -0.08678
magnitude: 0.10709 au
magnitude: 0.27220 debye
