program: Orca
programVersion: 5.0.2
elementType: O O O O C C C C C C C C C C C C C C C C C C C C C C C C H H H H H H H H H H H H H H H H H H H H H H H H H H H H H H H H
charge: 0
multiplicity: 1
keywords: wb97x-d3
keywords: def2-TZVPP
keywords: def2/J RIJCOSX
keywords: DEFGRID2
keywords: scfconv7
keywords: smallprint printgap noloewdin
keywords: NOSOSCF
formula: C24H32O4
InChI: InChI=1/C24H32O4/c1-3-4-5-6-7-8-9-10-11-12-17-21-22(26)19-15-13-14-16-20(19)23(27)24(21)28-18(2)25/h13-16H,3-12,17H2,1-2H3
60 atoms
O  1.288892 -1.770251 2.134528
O  2.336398 2.50781 0.535071
O  -1.129734 -0.818965 2.721235
O  -0.048447 -2.672309 0.57802
C  1.404319 -0.613576 -3.359758
C  1.016424 0.725606 -2.742583
C  2.73682 -1.185566 -2.875326
C  -0.262861 1.328767 -3.317575
C  2.815613 -1.349289 -1.351251
C  -1.499376 0.437984 -3.225104
C  3.537343 -0.194548 -0.661541
C  -1.877422 0.025199 -1.807934
C  3.287288 -0.109675 0.850011
C  -3.139351 -0.827779 -1.765498
C  1.88357 0.296389 1.176892
C  -3.552052 -1.2392 -0.358509
C  0.970261 -0.510736 1.733103
C  1.500538 1.704259 0.87969
C  0.073588 2.096265 1.002474
C  -0.846898 1.239256 1.600506
C  -4.792446 -2.120067 -0.338879
C  -0.414093 -0.088559 2.079119
C  -0.339657 3.337249 0.534385
C  -2.1716 1.629751 1.747781
C  -1.667044 3.712202 0.65754
C  -2.581011 2.862067 1.267914
C  0.602469 -2.80197 1.568792
C  0.805393 -4.059076 2.351312
H  1.433004 -0.512451 -4.449939
H  0.62269 -1.34917 -3.146322
H  1.831916 1.442892 -2.878619
H  0.900822 0.609326 -1.661088
H  3.561126 -0.553071 -3.222416
H  2.884593 -2.153431 -3.360047
H  -0.465489 2.272465 -2.800714
H  -0.093351 1.589511 -4.367147
H  1.800752 -1.45743 -0.957909
H  3.326786 -2.282006 -1.097044
H  -2.343294 0.969417 -3.67639
H  -1.35929 -0.458267 -3.837688
H  3.266966 0.754784 -1.124102
H  4.613573 -0.299371 -0.822615
H  -2.017465 0.922267 -1.19389
H  -1.059494 -0.534623 -1.342102
H  3.967115 0.629299 1.278994
H  3.521969 -1.065473 1.319095
H  -3.963491 -0.284776 -2.242231
H  -2.983621 -1.727187 -2.371527
H  -3.73354 -0.340678 0.23905
H  -2.722682 -1.761638 0.125084
H  -5.071027 -2.398077 0.677958
H  -5.648127 -1.613229 -0.789076
H  -4.628844 -3.043133 -0.897541
H  0.380658 3.999969 0.074645
H  -2.874195 0.961359 2.22606
H  -1.990578 4.673637 0.28168
H  -3.615112 3.162843 1.368896
H  0.249577 -3.988823 3.287425
H  1.854208 -4.206141 2.604971
H  0.440037 -4.912699 1.788616
totalener: -1234.87025593 hartree
nucrepener: 2864.62206237 hartree
electener: -4099.49231831 hartree
oneelecener: -7375.22984262 hartree
twoeener: 3275.73752431 hartree
kineticenergy: 1229.34394971 hartree
xcener: -121.325711083145 hartree
chargesum: 0.0000000
charge: -0.285119 -0.323726 -0.322219 -0.338796 -0.149076 -0.021815 -0.173055 -0.170815 -0.058146 -0.126494 -0.209901 -0.057948 -0.103720 -0.103632 -0.082530 -0.061626 0.231061 0.281909 -0.027728 -0.078085 -0.271983 0.279229 -0.137327 -0.128415 -0.078984 -0.086529 0.393756 -0.256885 0.070574 0.072119 0.084461 -0.051903 0.066929 0.076615 0.067671 0.076149 0.042173 0.078797 0.069453 0.067351 0.104550 0.083022 0.028368 0.036737 0.104946 0.087775 0.049722 0.053226 0.036215 0.066385 0.084197 0.070150 0.074415 0.134378 0.144238 0.134126 0.134403 0.114367 0.101924 0.105069
qa: -0.2851 -0.3237 -0.3222 -0.3388 -0.1491 -0.0218 -0.1731 -0.1708 -0.0581 -0.1265 -0.2099 -0.0579 -0.1037 -0.1036 -0.0825 -0.0616 0.2311 0.2819 -0.0277 -0.0781 -0.2720 0.2792 -0.1373 -0.1284 -0.0790 -0.0865 0.3938 -0.2569 0.0706 0.0721 0.0845 -0.0519 0.0669 0.0766 0.0677 0.0761 0.0422 0.0788 0.0695 0.0674 0.1045 0.0830 0.0284 0.0367 0.1049 0.0878 0.0497 0.0532 0.0362 0.0664 0.0842 0.0701 0.0744 0.1344 0.1442 0.1341 0.1344 0.1144 0.1019 0.1051
va: 2.1181 2.1554 2.1506 2.1443 3.9069 3.7985 3.9471 3.9355 3.7692 3.9043 3.9030 3.8727 3.8578 3.8996 3.6629 3.8786 3.7144 3.9616 3.6491 3.6556 3.9748 4.1120 3.9776 3.9446 3.9416 3.9395 4.0545 3.9159 1.0136 1.0020 1.0128 1.0530 1.0084 1.0076 1.0105 1.0098 1.0265 1.0072 1.0123 1.0052 1.0085 1.0128 1.0174 1.0155 1.0181 1.0205 1.0099 1.0110 1.0094 1.0154 1.0052 1.0018 1.0035 1.0263 1.0161 0.9994 1.0005 1.0040 1.0056 1.0134
dispcorr: -0.038181068 hartree
energy: -1234.908436998877
dipole: -9.18713 9.27126 0.08413 -11.76135 11.74803 -0.01333 -29.90050 30.17283 0.27233
magnitude: 0.28534 au
magnitude: 0.72528 debye
