program: Orca
programVersion: 5.0.2
elementType: O O O O C C C C C C C C C C C C C C C C C C C C C C C C H H H H H H H H H H H H H H H H H H H H H H H H H H H H H H H H
charge: 0
multiplicity: 1
keywords: wb97x-d3
keywords: def2-TZVPP
keywords: def2/J RIJCOSX
keywords: DEFGRID2
keywords: scfconv7
keywords: smallprint printgap noloewdin
keywords: NOSOSCF
formula: C24H32O4
InChI: InChI=1/C24H32O4/c1-3-4-5-6-7-8-9-10-11-12-17-21-22(26)19-15-13-14-16-20(19)23(27)24(21)28-18(2)25/h13-16H,3-12,17H2,1-2H3
60 atoms
O  1.842011 -1.762145 -1.764723
O  1.837545 2.739097 -0.453875
O  -0.563746 -1.351807 -2.831355
O  0.418072 -2.737785 -0.332035
C  1.567328 -1.648899 3.982669
C  0.124352 -1.722281 3.486255
C  2.430234 -0.589277 3.29768
C  -0.662134 -0.425723 3.654008
C  2.434795 -0.68507 1.777352
C  -2.02944 -0.448528 2.972861
C  3.288879 0.389614 1.123179
C  -1.947886 -0.274397 1.458754
C  3.276575 0.338423 -0.410787
C  -3.285347 -0.426743 0.739578
C  1.907676 0.463829 -1.007241
C  -4.390025 0.515844 1.211444
C  1.256151 -0.546048 -1.600179
C  1.25783 1.80008 -0.95001
C  -0.107247 1.962032 -1.51435
C  -0.751142 0.895524 -2.137411
C  -4.016296 1.989466 1.126663
C  -0.080786 -0.416788 -2.239196
C  -0.735151 3.199381 -1.440634
C  -2.015068 1.067902 -2.688649
C  -1.995407 3.366905 -1.988923
C  -2.634806 2.303025 -2.612776
C  1.25511 -2.839885 -1.174185
C  1.824871 -4.108558 -1.723956
H  2.032745 -2.629856 3.845979
H  1.573433 -1.462111 5.061163
H  -0.393841 -2.516169 4.032954
H  0.114929 -2.039852 2.440691
H  3.455278 -0.673462 3.672155
H  2.093861 0.410468 3.589361
H  -0.782982 -0.223593 4.722819
H  -0.093963 0.42156 3.255783
H  2.785255 -1.677881 1.473116
H  1.410341 -0.603519 1.405962
H  -2.543108 -1.38742 3.209776
H  -2.650333 0.346647 3.395615
H  4.327804 0.287905 1.449833
H  2.962581 1.375588 1.458931
H  -1.250714 -1.001919 1.035091
H  -1.519081 0.709446 1.237312
H  3.736433 -0.591544 -0.745202
H  3.896226 1.15186 -0.794378
H  -3.122312 -0.272917 -0.331714
H  -3.630554 -1.459762 0.845158
H  -4.679469 0.271325 2.237338
H  -5.282231 0.33535 0.60541
H  -4.863928 2.627968 1.377862
H  -3.205817 2.244072 1.810826
H  -3.684856 2.254755 0.121359
H  -0.229944 4.024764 -0.958363
H  -2.50309 0.233479 -3.173599
H  -2.483221 4.330714 -1.930518
H  -3.619367 2.438784 -3.039823
H  2.91338 -4.075911 -1.751802
H  1.476469 -4.244159 -2.748689
H  1.498677 -4.953969 -1.126014
totalener: -1234.87116161 hartree
nucrepener: 2827.12764686 hartree
electener: -4061.99880847 hartree
oneelecener: -7300.26563764 hartree
twoeener: 3238.26682918 hartree
kineticenergy: 1229.34820259 hartree
xcener: -121.327615406931 hartree
chargesum: 0.0000000
charge: -0.285595 -0.329679 -0.324379 -0.334729 -0.154017 -0.119117 -0.144859 -0.134783 -0.069587 -0.138033 -0.161376 -0.102377 -0.119002 -0.154274 -0.148407 -0.106608 0.239137 0.375138 -0.158930 -0.065849 -0.247899 0.330403 -0.059709 -0.107627 -0.128884 -0.092183 0.387682 -0.252505 0.068851 0.070181 0.070351 0.070709 0.071209 0.067295 0.077333 0.059158 0.059915 0.023875 0.062601 0.070088 0.072729 0.090365 0.067391 0.048772 0.092502 0.106173 0.066428 0.077676 0.061569 0.065855 0.088791 0.073344 0.058902 0.135450 0.138595 0.135006 0.136201 0.101284 0.113955 0.105491
qa: -0.2856 -0.3297 -0.3244 -0.3347 -0.1540 -0.1191 -0.1449 -0.1348 -0.0696 -0.1380 -0.1614 -0.1024 -0.1190 -0.1543 -0.1484 -0.1066 0.2391 0.3751 -0.1589 -0.0658 -0.2479 0.3304 -0.0597 -0.1076 -0.1289 -0.0922 0.3877 -0.2525 0.0689 0.0702 0.0704 0.0707 0.0712 0.0673 0.0773 0.0592 0.0599 0.0239 0.0626 0.0701 0.0727 0.0904 0.0674 0.0488 0.0925 0.1062 0.0664 0.0777 0.0616 0.0659 0.0888 0.0733 0.0589 0.1355 0.1386 0.1350 0.1362 0.1013 0.1140 0.1055
va: 2.1114 2.1529 2.1530 2.1583 3.9168 3.8572 3.9168 3.8887 3.8242 3.9324 3.8862 3.8573 3.8565 3.9045 3.7068 3.8754 3.6906 3.9591 3.7709 3.6435 3.9283 4.0583 3.9423 3.9001 3.9308 3.8804 4.0596 3.9127 1.0086 1.0097 1.0142 1.0131 1.0123 1.0045 1.0106 1.0105 1.0136 1.0186 1.0106 1.0071 1.0139 1.0183 1.0314 0.9987 1.0195 1.0169 1.0181 1.0129 1.0050 1.0096 1.0097 1.0015 1.0099 1.0247 1.0240 1.0011 0.9996 1.0053 1.0044 1.0136
dispcorr: -0.036661312 hartree
energy: -1234.907822920039
dipole: -11.12343 11.27493 0.15150 -5.51504 5.50804 -0.00700 34.18049 -34.70218 -0.52169
magnitude: 0.54328 au
magnitude: 1.38092 debye
