program: Orca
programVersion: 5.0.2
elementType: O O O O C C C C C C C C C C C C C C C C C C C C C C C C H H H H H H H H H H H H H H H H H H H H H H H H H H H H H H H H
charge: 0
multiplicity: 1
keywords: wb97x-d3
keywords: def2-TZVPP
keywords: def2/J RIJCOSX
keywords: DEFGRID2
keywords: scfconv7
keywords: smallprint printgap noloewdin
keywords: NOSOSCF
formula: C24H32O4
InChI: InChI=1/C24H32O4/c1-3-4-5-6-7-8-9-10-11-12-17-21-22(26)19-15-13-14-16-20(19)23(27)24(21)28-18(2)25/h13-16H,3-12,17H2,1-2H3
60 atoms
O  1.561145 -1.791218 -1.944297
O  1.802448 2.578558 -0.258584
O  -0.636103 -1.050847 -3.252037
O  -0.11943 -2.686735 -0.760883
C  1.916438 -0.339926 4.00213
C  0.513733 0.219474 3.780726
C  2.292283 -1.520653 3.108112
C  -0.598814 -0.791168 4.03942
C  2.183398 -1.255274 1.608393
C  -1.991872 -0.168401 4.087415
C  3.021904 -0.072519 1.143587
C  -2.467091 0.477938 2.788571
C  3.080669 0.090968 -0.37938
C  -2.657426 -0.50233 1.637558
C  1.756812 0.36516 -1.024918
C  -3.269749 0.145942 0.40278
C  1.07396 -0.5388 -1.740165
C  1.194179 1.734076 -0.875887
C  -0.124651 2.039592 -1.488826
C  -0.774522 1.096341 -2.282165
C  -3.576538 -0.858761 -0.697529
C  -0.171926 -0.234744 -2.492387
C  -0.703543 3.286975 -1.288616
C  -1.986581 1.404404 -2.885996
C  -1.921542 3.584185 -1.877068
C  -2.560802 2.646274 -2.678006
C  0.800728 -2.83295 -1.504473
C  1.303306 -4.122083 -2.070772
H  2.011371 -0.653238 5.046588
H  2.644823 0.465376 3.871252
H  0.42954 0.621242 2.765913
H  0.374839 1.077554 4.446506
H  1.669734 -2.384077 3.357511
H  3.319217 -1.818731 3.342476
H  -0.570329 -1.584214 3.286584
H  -0.40873 -1.286351 4.997583
H  2.504459 -2.156471 1.075945
H  1.136088 -1.107055 1.329899
H  -2.715054 -0.936136 4.380462
H  -2.010956 0.58074 4.885537
H  4.049909 -0.198145 1.497438
H  2.661646 0.854545 1.592256
H  -1.779304 1.273531 2.484359
H  -3.422161 0.976559 2.98266
H  3.523559 -0.802454 -0.820318
H  3.749118 0.921815 -0.614012
H  -1.705181 -0.965772 1.360125
H  -3.302172 -1.323704 1.971008
H  -2.593483 0.91821 0.022933
H  -4.189385 0.667794 0.686565
H  -3.998156 -0.372942 -1.578037
H  -2.681159 -1.396489 -1.010049
H  -4.299185 -1.602964 -0.358005
H  -0.196584 4.018827 -0.674899
H  -2.475936 0.665179 -3.505019
H  -2.373436 4.553746 -1.71591
H  -3.50977 2.885394 -3.138901
H  0.824112 -4.959578 -1.573022
H  2.384846 -4.205188 -1.972115
H  1.068501 -4.161522 -3.135253
totalener: -1234.87226713 hartree
nucrepener: 2826.25508769 hartree
electener: -4061.12735482 hartree
oneelecener: -7298.50018740 hartree
twoeener: 3237.37283258 hartree
kineticenergy: 1229.34865759 hartree
xcener: -121.326228611977 hartree
chargesum: -0.0000000
charge: -0.285643 -0.330652 -0.320806 -0.329912 -0.162141 -0.098449 -0.174044 -0.153918 -0.061668 -0.147063 -0.197431 -0.116630 -0.104608 -0.098338 -0.125757 -0.061433 0.263055 0.337052 -0.101122 -0.073014 -0.271259 0.252627 -0.092999 -0.104279 -0.092000 -0.089033 0.380000 -0.251886 0.072252 0.078126 0.047817 0.075618 0.080902 0.073520 0.070637 0.073574 0.063390 0.045188 0.069585 0.068867 0.076743 0.094480 0.062899 0.068215 0.091096 0.104760 0.045080 0.055580 0.018216 0.058995 0.073024 0.090960 0.083813 0.136289 0.142781 0.133442 0.134380 0.104616 0.101382 0.115124
qa: -0.2856 -0.3307 -0.3208 -0.3299 -0.1621 -0.0984 -0.1740 -0.1539 -0.0617 -0.1471 -0.1974 -0.1166 -0.1046 -0.0983 -0.1258 -0.0614 0.2631 0.3371 -0.1011 -0.0730 -0.2713 0.2526 -0.0930 -0.1043 -0.0920 -0.0890 0.3800 -0.2519 0.0723 0.0781 0.0478 0.0756 0.0809 0.0735 0.0706 0.0736 0.0634 0.0452 0.0696 0.0689 0.0767 0.0945 0.0629 0.0682 0.0911 0.1048 0.0451 0.0556 0.0182 0.0590 0.0730 0.0910 0.0838 0.1363 0.1428 0.1334 0.1344 0.1046 0.1014 0.1151
va: 2.1098 2.1487 2.1505 2.1534 3.9149 3.8446 3.9173 3.8662 3.8311 3.9319 3.8920 3.8568 3.8544 3.8791 3.6976 3.8700 3.6845 3.9557 3.7686 3.6334 3.9481 4.1165 3.9776 3.9108 3.9530 3.9422 4.0615 3.9129 1.0109 1.0045 1.0058 1.0129 1.0046 1.0092 0.9995 1.0132 1.0159 1.0118 1.0099 1.0101 1.0139 1.0126 1.0055 1.0131 1.0199 1.0168 1.0162 1.0156 1.0160 1.0128 1.0048 1.0078 1.0092 1.0246 1.0198 1.0002 1.0006 1.0140 1.0054 1.0039
dispcorr: -0.036386935 hartree
energy: -1234.908654068389
dipole: -8.26890 8.44803 0.17914 -9.79805 9.81094 0.01289 34.89905 -35.25507 -0.35603
magnitude: 0.39876 au
magnitude: 1.01357 debye
