program: Orca
programVersion: 5.0.2
elementType: O O O O C C C C C C C C C C C C C C C C C C C C C C C C H H H H H H H H H H H H H H H H H H H H H H H H H H H H H H H H
charge: 0
multiplicity: 1
keywords: wb97x-d3
keywords: def2-TZVPP
keywords: def2/J RIJCOSX
keywords: DEFGRID2
keywords: scfconv7
keywords: smallprint printgap noloewdin
keywords: NOSOSCF
formula: C24H32O4
InChI: InChI=1/C24H32O4/c1-3-4-5-6-7-8-9-10-11-12-17-21-22(26)19-15-13-14-16-20(19)23(27)24(21)28-18(2)25/h13-16H,3-12,17H2,1-2H3
60 atoms
O  1.560812 -1.741387 -2.121623
O  2.228179 2.336429 0.096614
O  -0.788625 -0.796487 -2.936125
O  0.058466 -2.765707 -0.81152
C  1.362951 0.036824 3.578253
C  0.176031 0.684903 2.872146
C  2.558269 -0.184051 2.65298
C  -1.097445 0.679751 3.706105
C  2.324585 -1.327433 1.668298
C  -2.284622 1.361129 3.029087
C  3.328576 -1.414788 0.525708
C  -2.654866 0.807036 1.654326
C  3.321445 -0.224092 -0.448185
C  -2.922508 -0.69267 1.625321
C  1.962861 0.226401 -0.90493
C  -3.409741 -1.180677 0.266721
C  1.158556 -0.524718 -1.667907
C  1.504088 1.591617 -0.524004
C  0.135509 2.023015 -0.909292
C  -0.669605 1.216576 -1.710194
C  -3.610359 -2.687637 0.212881
C  -0.169825 -0.091146 -2.175437
C  -0.341718 3.252368 -0.47121
C  -1.941136 1.639376 -2.076254
C  -1.613618 3.666444 -0.829083
C  -2.412501 2.862039 -1.631313
C  0.830786 -2.821044 -1.717879
C  1.164133 -4.018747 -2.547638
H  1.055284 -0.924018 4.006593
H  1.660016 0.661245 4.425774
H  -0.016686 0.166033 1.928124
H  0.436685 1.713258 2.598256
H  3.452232 -0.403206 3.244619
H  2.771878 0.749406 2.125751
H  -1.356875 -0.354438 3.9539
H  -0.906175 1.172741 4.664589
H  2.346145 -2.272041 2.219569
H  1.318111 -1.268623 1.246893
H  -3.154197 1.287535 3.689822
H  -2.07322 2.430602 2.927944
H  3.154822 -2.340892 -0.025184
H  4.342908 -1.497933 0.926986
H  -1.867052 1.042705 0.933015
H  -3.542708 1.336654 1.294287
H  3.915509 -0.491311 -1.325951
H  3.824797 0.626664 0.007764
H  -2.011859 -1.240941 1.888648
H  -3.661648 -0.951341 2.392471
H  -2.68878 -0.889295 -0.502128
H  -4.34515 -0.671147 0.0139
H  -3.986373 -3.00513 -0.760057
H  -2.669617 -3.211135 0.385798
H  -4.324167 -3.022048 0.968069
H  0.286631 3.876831 0.148609
H  -2.554639 1.003802 -2.700031
H  -1.985425 4.62081 -0.481016
H  -3.405716 3.189478 -1.907586
H  0.720537 -4.909457 -2.112785
H  2.242029 -4.15057 -2.637625
H  0.767083 -3.878885 -3.55424
totalener: -1234.87086107 hartree
nucrepener: 2875.22748505 hartree
electener: -4110.09834611 hartree
oneelecener: -7396.48401473 hartree
twoeener: 3286.38566861 hartree
kineticenergy: 1229.34786355 hartree
xcener: -121.327606058982 hartree
chargesum: 0.0000000
charge: -0.281463 -0.332344 -0.324208 -0.328610 -0.133509 -0.079019 -0.143841 -0.128303 -0.112776 -0.156318 -0.169566 -0.017201 -0.171901 -0.143473 -0.033777 -0.053163 0.187770 0.263821 -0.069282 -0.054250 -0.262675 0.305401 -0.079771 -0.096333 -0.103077 -0.089929 0.372463 -0.246042 0.059181 0.073270 -0.004421 0.066376 0.075080 0.080743 0.066045 0.071628 0.076927 0.072576 0.073789 0.066596 0.080738 0.082878 -0.036446 0.070592 0.100813 0.111992 0.058842 0.063040 0.031637 0.055498 0.079855 0.079596 0.071652 0.131901 0.134158 0.132342 0.132678 0.104413 0.102062 0.115347
qa: -0.2815 -0.3323 -0.3242 -0.3286 -0.1335 -0.0790 -0.1438 -0.1283 -0.1128 -0.1563 -0.1696 -0.0172 -0.1719 -0.1435 -0.0338 -0.0532 0.1878 0.2638 -0.0693 -0.0543 -0.2627 0.3054 -0.0798 -0.0963 -0.1031 -0.0899 0.3725 -0.2460 0.0592 0.0733 -0.0044 0.0664 0.0751 0.0807 0.0660 0.0716 0.0769 0.0726 0.0738 0.0666 0.0807 0.0829 -0.0364 0.0706 0.1008 0.1120 0.0588 0.0630 0.0316 0.0555 0.0799 0.0796 0.0717 0.1319 0.1342 0.1323 0.1327 0.1044 0.1021 0.1153
va: 2.1165 2.1331 2.1518 2.1480 3.9458 3.8507 3.8661 3.8992 3.8618 3.9252 3.9190 3.8235 3.8439 3.9013 3.6495 3.8871 3.8162 3.9629 3.7164 3.6344 3.9654 4.0531 3.9210 3.9231 3.9496 3.9212 4.0514 3.9088 1.0095 1.0113 1.0146 1.0143 1.0133 1.0206 1.0043 1.0123 1.0128 1.0047 1.0087 1.0115 1.0081 1.0103 1.0435 1.0120 1.0090 1.0181 1.0028 1.0118 1.0137 1.0099 1.0064 1.0114 1.0035 1.0267 1.0250 1.0001 1.0006 1.0140 1.0051 1.0040
dispcorr: -0.038753704 hartree
energy: -1234.909614772113
dipole: -11.21381 11.35277 0.13896 -10.88810 10.98297 0.09487 28.98003 -29.42315 -0.44313
magnitude: 0.47400 au
magnitude: 1.20480 debye
