program: Orca
programVersion: 5.0.2
elementType: O O O O C C C C C C C C C C C C C C C C C C C C C C C C H H H H H H H H H H H H H H H H H H H H H H H H H H H H H H H H
charge: 0
multiplicity: 1
keywords: wb97x-d3
keywords: def2-TZVPP
keywords: def2/J RIJCOSX
keywords: DEFGRID2
keywords: scfconv7
keywords: smallprint printgap noloewdin
keywords: NOSOSCF
formula: C24H32O4
InChI: InChI=1/C24H32O4/c1-3-4-5-6-7-8-9-10-11-12-17-21-22(26)19-15-13-14-16-20(19)23(27)24(21)28-18(2)25/h13-16H,3-12,17H2,1-2H3
60 atoms
O  3.695115 0.41623 -1.922752
O  0.356288 -2.777399 -1.15852
O  1.741009 2.170527 -2.399636
O  3.647314 1.603483 -0.025247
C  0.18936 -1.241814 2.312362
C  -0.571427 0.073358 2.430275
C  1.622831 -1.040309 1.837097
C  -2.051151 -0.096593 2.74655
C  2.374616 -2.339792 1.532062
C  -2.789042 1.235512 2.820271
C  3.526651 -2.172924 0.537805
C  -4.285118 1.119908 3.098858
C  3.130254 -2.232257 -0.950745
C  -5.091707 0.514494 1.955653
C  2.102764 -1.216548 -1.340069
C  -6.585075 0.438598 2.247408
C  2.404095 0.027924 -1.72902
C  0.668888 -1.615523 -1.284092
C  -0.362243 -0.550499 -1.351274
C  -0.010551 0.754969 -1.688117
C  -7.386524 -0.152273 1.096462
C  1.397528 1.086787 -1.99178
C  -1.686064 -0.859061 -1.065647
C  -0.981114 1.747847 -1.734149
C  -2.647838 0.136683 -1.095045
C  -2.29543 1.438696 -1.427274
C  4.191507 1.338187 -1.052592
C  5.464018 1.925256 -1.573799
H  -0.333357 -1.895943 1.605593
H  0.176949 -1.770929 3.271114
H  -0.475506 0.623255 1.48716
H  -0.100578 0.703931 3.191966
H  2.183685 -0.466468 2.581095
H  1.60606 -0.391788 0.959129
H  -2.502132 -0.734519 1.97982
H  -2.17073 -0.632977 3.694285
H  2.771348 -2.744419 2.466653
H  1.682702 -3.100246 1.158921
H  -2.327565 1.848574 3.600309
H  -2.636665 1.781786 1.882458
H  4.25952 -2.968593 0.691735
H  4.050839 -1.235437 0.741404
H  -4.684304 2.115168 3.317519
H  -4.441975 0.528569 4.007491
H  2.744125 -3.227171 -1.173793
H  4.0275 -2.097034 -1.555974
H  -4.931839 1.112032 1.050045
H  -4.722331 -0.489919 1.72442
H  -6.960287 1.439907 2.479114
H  -6.745847 -0.158349 3.149946
H  -7.278361 0.445728 0.18976
H  -7.055347 -1.16541 0.86199
H  -8.450058 -0.201629 1.330544
H  -1.952901 -1.875887 -0.812136
H  -0.69774 2.757156 -1.999898
H  -3.675322 -0.100724 -0.853918
H  -3.049693 2.214049 -1.447902
H  6.113963 1.164086 -2.002267
H  5.985533 2.452097 -0.780345
H  5.223787 2.635046 -2.366908
totalener: -1234.86935283 hartree
nucrepener: 2742.29476652 hartree
electener: -3977.16411935 hartree
oneelecener: -7130.22603193 hartree
twoeener: 3153.06191258 hartree
kineticenergy: 1229.34864544 hartree
xcener: -121.323389728587 hartree
chargesum: 0.0000000
charge: -0.285503 -0.320259 -0.325200 -0.323047 -0.152784 -0.114308 -0.079878 -0.133736 -0.168837 -0.106481 -0.150706 -0.130290 -0.154857 -0.106559 0.038898 -0.087828 0.145194 0.221953 -0.059840 -0.099156 -0.252573 0.348692 -0.118849 -0.052337 -0.104619 -0.122314 0.363142 -0.252173 0.060324 0.079315 0.050071 0.079031 0.087867 0.028470 0.050873 0.072525 0.084042 0.077851 0.077086 0.053899 0.084132 0.076525 0.069589 0.056831 0.106481 0.095209 0.037026 0.055509 0.053875 0.055577 0.069154 0.071867 0.087539 0.138265 0.135097 0.137061 0.133989 0.101598 0.104108 0.113474
qa: -0.2855 -0.3203 -0.3252 -0.3230 -0.1528 -0.1143 -0.0799 -0.1337 -0.1688 -0.1065 -0.1507 -0.1303 -0.1549 -0.1066 0.0389 -0.0878 0.1452 0.2220 -0.0598 -0.0992 -0.2526 0.3487 -0.1188 -0.0523 -0.1046 -0.1223 0.3631 -0.2522 0.0603 0.0793 0.0501 0.0790 0.0879 0.0285 0.0509 0.0725 0.0840 0.0779 0.0771 0.0539 0.0841 0.0765 0.0696 0.0568 0.1065 0.0952 0.0370 0.0555 0.0539 0.0556 0.0692 0.0719 0.0875 0.1383 0.1351 0.1371 0.1340 0.1016 0.1041 0.1135
va: 2.1252 2.1458 2.1565 2.1692 3.8974 3.8681 3.8240 3.8579 3.8916 3.8780 3.9152 3.9273 3.8537 3.8856 3.6147 3.9092 3.8097 4.0264 3.6458 3.7329 3.9427 4.0834 3.9271 3.9543 3.8924 3.9257 4.1059 3.9114 1.0087 1.0134 1.0113 1.0158 1.0122 1.0435 1.0116 1.0162 1.0074 1.0144 1.0138 1.0139 1.0092 1.0160 1.0112 1.0112 1.0236 1.0154 1.0081 1.0045 1.0087 1.0078 1.0035 1.0038 1.0071 1.0260 1.0218 0.9951 1.0012 1.0066 1.0135 1.0040
dispcorr: -0.035527222 hartree
energy: -1234.904880052304
dipole: -32.12018 32.13905 0.01887 -3.12212 3.20242 0.08030 32.32623 -32.37906 -0.05283
magnitude: 0.09795 au
magnitude: 0.24897 debye
