program: Gaussian 09
title: 000054928
version: EM64L-G09RevD.01
frameworkgroup: C1[X(C9H17N3OS2)]
method: RPBEPBE
basis: SDD
operation: Freq
keyword: #p
keyword: freq=noraman
keyword: PBEPBE/SDD
title: #p freq=noraman PBEPBE/SDD
converged: YES YES NO NO
title: Mulliken charges:
elementType: S S O N N N C C C C C C C C C H H H H H H H H H H H H H H H H H
charge: 0.169201 0.000192 -0.284273 -0.075737 0.005593 0.063521 -0.321115 -0.433908 -0.445061 -0.379632 -0.417483 -0.363107 -0.376030 -0.641905 -0.634548 0.326219 0.253255 0.243353 0.234887 0.238770 0.244849 0.271628 0.262171 0.216169 0.244960 0.226366 0.207110 0.251726 0.222293 0.214826 0.257831 0.217876
chargesum: 0.00000
title: Mulliken charges with hydrogens summed into heavy atoms:
elementType: S S O N N N C C C C C C C C C
charge: 0.169201 0.000192 -0.284273 -0.075737 0.005593 0.063521 0.005104 0.062700 0.028597 0.136845 -0.417483 0.115233 0.095296 0.039224 0.055985
polarizability: 2.12210774e+02 1.44054800e+00 1.51066675e+02 2.47021021e+00 -6.69745864e+00 1.32306335e+02
1716.lowfreq: -13.0479 -9.3278 0.0016 0.0022 0.0029 3.1012 3.8548 19.8546 49.3310
frequency: -9.4231 19.6721 49.1534 60.9545 71.2520 83.2979 99.0518 129.2704 147.5995 188.1610 205.0166 210.2592 222.5981 229.4158 279.6860 293.2999 333.0264 343.4695 364.7442 396.9909 427.8722 467.4475 494.4937 537.6801 564.3636 581.3507 651.2715 736.6227 762.5120 776.8890 804.8983 812.7497 854.7452 883.3090 905.2048 918.3354 957.1916 978.3890 1007.9566 1039.9147 1066.4990 1077.3247 1085.6288 1094.4354 1098.6463 1148.0651 1166.1862 1185.2421 1191.6565 1199.3137 1223.1616 1262.5798 1273.3469 1278.8863 1291.2910 1297.2961 1308.2909 1326.7703 1335.1782 1341.6042 1352.5423 1383.8826 1389.4269 1427.2379 1462.8298 1467.3377 1468.3790 1469.1747 1473.1332 1480.7735 1483.6907 1484.4653 1504.8623 2942.2264 2987.6466 2990.1666 2996.7787 3007.0158 3010.9656 3019.6999 3020.5522 3061.4393 3070.2483 3076.9671 3087.0893 3087.6123 3088.0288 3100.9935 3102.9664 3104.4392
redmass: 5.4969 5.2717 3.2188 5.5102 2.9673 2.8867 4.7337 3.3680 6.0222 2.0059 1.9586 1.0323 4.2525 1.7949 5.1313 3.7710 3.4799 5.6911 4.8846 6.0005 3.6701 4.3243 5.5476 3.4600 2.5225 4.4533 3.4852 6.0732 1.7555 1.1358 2.2356 2.3318 2.0226 1.5324 2.9575 2.5473 2.6074 1.9852 2.8337 2.2426 2.2476 1.8790 2.1985 1.8736 1.9477 1.8959 3.3794 1.5653 2.4463 2.1859 1.3788 1.3255 1.2967 1.5595 1.2410 1.4009 1.2240 1.7173 1.2735 2.6176 1.2747 1.2109 1.2026 1.9649 1.0890 1.0494 1.0602 1.0829 1.0816 1.0574 1.0744 1.0884 1.2972 1.0880 1.0356 1.0356 1.0655 1.0616 1.0613 1.0623 1.0646 1.1019 1.1007 1.0971 1.0999 1.0997 1.1010 1.1048 1.1018 1.1018
irintensity: 2.1992 2.7891 2.5871 1.2510 1.3235 0.1493 1.5604 0.3757 0.3768 1.2906 1.6469 0.1343 10.0967 1.1074 3.1524 3.0827 3.2332 4.2547 10.0149 12.1943 14.2358 5.4405 6.9177 9.7382 2.7190 2.1617 13.8811 99.5561 7.0235 2.5142 60.4953 3.6504 2.5007 8.4741 55.4013 12.3363 41.6111 4.4574 19.0679 41.2554 18.8890 20.6832 93.5580 13.0169 20.7746 27.6845 19.9087 8.4387 68.4848 69.9959 6.9528 65.6916 27.8561 53.5413 21.8882 8.3240 1.9785 13.2461 11.1880 54.1802 19.4815 14.3838 26.2772 135.2185 15.7912 16.3179 4.4871 8.1293 12.4394 5.6707 31.3692 3.7798 92.0279 97.5892 29.8451 23.9249 20.6922 31.1590 33.4426 15.2250 28.9992 9.7935 3.7743 12.9943 30.9297 30.4883 21.9434 25.2520 7.9359 40.1794
temp: 298.150 k
press: 1.00000 atm
elementType: 16 16 8 7 7 7 6 6 6 6 6 6 6 6 6 1 1 1 1 1 1 1 1 1 1 1 1 1 1 1 1 1
symmnumber: 1
zpe: 680340.7 jmol-1
zpe.correction: 0.259128 hartree
zpe.thermalcorrener: 0.275798 hartree
zpe.thermalcorrenthalpy: 0.276742 hartree
zpe.thermalcorrgfe: 0.213253 hartree
zpe.sumelectzpe: -1387.502930 hartree
zpe.sumelectthermal: -1387.486260 hartree
zpe.sumelectthermalent: -1387.485316 hartree
zpe.sumelectthermalfe: -1387.548805 hartree
dipole: 1.8453 -0.9125 -4.4636
dipole: 4.9155
quadrupole: -83.0178 -111.6072 -110.8737
quadrupole: 16.5821 7.3924 -5.0396
quadrupole: 18.8151 -9.7743 -9.0408 16.5821 7.3924 -5.0396
hfenergy: -1387.7620582 hartree
pointgroup: C01 [X(C9H17N3O1S2)]
dipole: 0.786205 0.5620716 1.6750858 debye
polarizability: 211.6257406|-5.9904613|149.2417964|-3.8364221|-8.8696871|134.7162467 unknown
InChI: InChI=1S/C9H17N3OS2/c1-3-11(4-2)9(14)15-8-6-5-7-12(8)10-13/h8H,3-7H2,1-2H3
charge 0 multiplicity 1
32 atoms
S  0.237062 0.40149 1.196153
S  1.47758 1.743608 -1.37171
O  -2.899507 -1.743548 -1.182195
N  -2.248386 0.093178 -0.099531
N  2.746745 -0.047661 0.255362
N  -1.915853 -0.940865 -0.937874
C  -1.250786 1.118779 0.243981
C  -2.045879 2.128105 1.10878
C  -3.532353 1.897644 0.71589
C  -3.610866 0.379411 0.427216
C  1.622822 0.669917 -0.04602
C  3.964811 0.072011 -0.596805
C  2.850837 -1.008146 1.391571
C  4.898491 1.203633 -0.122926
C  2.419529 -2.436114 0.997389
H  -0.781916 1.557799 -0.660759
H  -1.699798 3.157955 0.926285
H  -1.898467 1.908683 2.181428
H  -4.227386 2.206207 1.51397
H  -3.783602 2.464571 -0.198098
H  -3.801258 -0.220137 1.338387
H  -4.35767 0.087141 -0.329474
H  3.636162 0.25941 -1.632819
H  4.480855 -0.905273 -0.564277
H  2.245698 -0.642307 2.238985
H  3.904824 -0.996234 1.724917
H  5.233391 1.045116 0.918496
H  4.379628 2.175054 -0.184279
H  5.794198 1.247214 -0.76869
H  3.033627 -2.823831 0.164908
H  1.361966 -2.448942 0.685083
H  2.539103 -3.118368 1.858654
