program: Orca
programVersion: 5.0.2
elementType: O O O O C C C C C C C C C C C C C C C C C C C C C C C C H H H H H H H H H H H H H H H H H H H H H H H H H H H H H H H H
charge: 0
multiplicity: 1
keywords: wb97x-d3
keywords: def2-TZVPP
keywords: def2/J RIJCOSX
keywords: DEFGRID2
keywords: scfconv7
keywords: smallprint printgap noloewdin
keywords: NOSOSCF
formula: C24H32O4
InChI: InChI=1/C24H32O4/c1-3-4-5-6-7-8-9-10-11-12-17-21-22(26)19-15-13-14-16-20(19)23(27)24(21)28-18(2)25/h13-16H,3-12,17H2,1-2H3
60 atoms
O  3.081352 -1.139573 -2.390199
O  0.769123 1.797328 0.426599
O  0.826524 -1.430483 -3.768801
O  2.379974 -3.178652 -1.782033
C  1.235802 -0.62726 4.15065
C  -0.228235 -0.727449 3.725301
C  2.202382 -0.158254 3.062381
C  -0.901614 0.623123 3.512066
C  2.365989 -1.166122 1.928777
C  -2.336376 0.503527 3.015024
C  3.470624 -0.827975 0.932062
C  -3.029692 1.850994 2.860697
C  3.202465 0.384855 0.027997
C  -4.435917 1.746692 2.286136
C  1.977101 0.217625 -0.820021
C  -5.127025 3.095227 2.128446
C  1.951197 -0.556532 -1.912907
C  0.744965 0.964137 -0.450966
C  -0.515965 0.670247 -1.179728
C  -0.516555 -0.172541 -2.289247
C  -6.521239 2.984627 1.528707
C  0.746735 -0.779073 -2.754797
C  -1.70406 1.253657 -0.757048
C  -1.69852 -0.429786 -2.971919
C  -2.882734 0.985827 -1.432902
C  -2.880895 0.145128 -2.53848
C  3.118314 -2.504237 -2.428982
C  4.194592 -2.972778 -3.354228
H  1.570952 -1.603826 4.514592
H  1.306464 0.049112 5.0084
H  -0.781369 -1.278698 4.492052
H  -0.315233 -1.328464 2.814417
H  3.182694 0.0089 3.520943
H  1.888085 0.811801 2.670551
H  -0.886487 1.182062 4.454407
H  -0.330609 1.222147 2.797868
H  2.596632 -2.143361 2.364264
H  1.421745 -1.308175 1.393915
H  -2.3413 -0.021187 2.05291
H  -2.914785 -0.124997 3.701051
H  3.657803 -1.704687 0.310309
H  4.401637 -0.639659 1.475189
H  -2.421657 2.501596 2.221504
H  -3.069723 2.352297 3.833651
H  4.069615 0.537551 -0.617471
H  3.100335 1.286786 0.630056
H  -4.393498 1.241856 1.313861
H  -5.04462 1.09922 2.926438
H  -4.510322 3.748746 1.503621
H  -5.186157 3.585941 3.104431
H  -6.995852 3.961104 1.431096
H  -6.491397 2.533503 0.53502
H  -7.170786 2.363756 2.14773
H  -1.700861 1.912831 0.100257
H  -1.684108 -1.080758 -3.8353
H  -3.807399 1.436063 -1.096579
H  -3.803811 -0.059464 -3.064177
H  3.882881 -2.785119 -4.382569
H  4.361919 -4.037673 -3.225332
H  5.125343 -2.430927 -3.191767
totalener: -1234.87320204 hartree
nucrepener: 2700.70965191 hartree
electener: -3935.58285395 hartree
oneelecener: -7047.03343325 hartree
twoeener: 3111.45057931 hartree
kineticenergy: 1229.34022025 hartree
xcener: -121.319699993773 hartree
chargesum: 0.0000000
charge: -0.285974 -0.339809 -0.327863 -0.310621 -0.142479 -0.128850 -0.146852 -0.119286 -0.115751 -0.125115 -0.160559 -0.146852 -0.170214 -0.108244 -0.059447 -0.079378 0.208935 0.272195 -0.030784 -0.096374 -0.255619 0.329727 -0.151997 -0.067933 -0.076063 -0.123525 0.351342 -0.252080 0.071306 0.068753 0.073462 0.065081 0.068628 0.075249 0.061684 0.067811 0.079618 0.063227 0.056805 0.071216 0.092399 0.075967 0.060498 0.072056 0.100659 0.111988 0.033566 0.067123 0.052035 0.058398 0.086628 0.065873 0.074463 0.162438 0.136669 0.133030 0.133645 0.113772 0.103790 0.101636
qa: -0.2860 -0.3398 -0.3279 -0.3106 -0.1425 -0.1289 -0.1469 -0.1193 -0.1158 -0.1251 -0.1606 -0.1469 -0.1702 -0.1082 -0.0594 -0.0794 0.2089 0.2722 -0.0308 -0.0964 -0.2556 0.3297 -0.1520 -0.0679 -0.0761 -0.1235 0.3513 -0.2521 0.0713 0.0688 0.0735 0.0651 0.0686 0.0752 0.0617 0.0678 0.0796 0.0632 0.0568 0.0712 0.0924 0.0760 0.0605 0.0721 0.1007 0.1120 0.0336 0.0671 0.0520 0.0584 0.0866 0.0659 0.0745 0.1624 0.1367 0.1330 0.1336 0.1138 0.1038 0.1016
va: 2.1179 2.1295 2.1496 2.1770 3.9301 3.8757 3.8651 3.8529 3.8583 3.8675 3.9140 3.8745 3.8442 3.8648 3.6490 3.8750 3.7851 4.0007 3.7472 3.7952 3.9529 4.0816 3.9572 3.9549 3.9380 3.9926 4.1215 3.9086 1.0090 1.0098 1.0118 1.0085 1.0142 1.0127 1.0166 1.0168 1.0108 1.0152 1.0080 1.0147 1.0189 1.0136 1.0115 1.0147 1.0138 1.0165 1.0170 1.0146 1.0071 1.0096 1.0063 1.0033 1.0030 0.9989 1.0226 0.9989 1.0013 1.0047 1.0142 1.0061
dispcorr: -0.032815055 hartree
energy: -1234.906017095178
dipole: -21.62479 21.66817 0.04338 10.35563 -10.15026 0.20537 39.41545 -39.69590 -0.28046
magnitude: 0.35031 au
magnitude: 0.89041 debye
