program: Orca
programVersion: 5.0.2
elementType: O O O O C C C C C C C C C C C C C C C C C C C C C C C C H H H H H H H H H H H H H H H H H H H H H H H H H H H H H H H H
charge: 0
multiplicity: 1
keywords: wb97x-d3
keywords: def2-TZVPP
keywords: def2/J RIJCOSX
keywords: DEFGRID2
keywords: scfconv7
keywords: smallprint printgap noloewdin
keywords: NOSOSCF
formula: C24H32O4
InChI: InChI=1/C24H32O4/c1-3-4-5-6-7-8-9-10-11-12-17-21-22(26)19-15-13-14-16-20(19)23(27)24(21)28-18(2)25/h13-16H,3-12,17H2,1-2H3
60 atoms
O  3.062951 -1.168354 -2.379472
O  0.799146 1.823441 0.419345
O  0.799202 -1.444233 -3.74799
O  2.336099 -3.193803 -1.755136
C  1.256356 -0.607738 4.146071
C  -0.206952 -0.726211 3.722791
C  2.21761 -0.1417 3.051846
C  -0.894617 0.615108 3.497074
C  2.382878 -1.157554 1.925494
C  -2.326102 0.474707 2.995853
C  3.485379 -0.824036 0.924971
C  -3.042754 1.810682 2.848953
C  3.215689 0.384965 0.016405
C  -4.440987 1.685442 2.259256
C  1.983181 0.221677 -0.822263
C  -5.156038 3.021857 2.105849
C  1.942194 -0.565261 -1.90558
C  0.762313 0.987323 -0.455229
C  -0.50329 0.710326 -1.182471
C  -0.519499 -0.144194 -2.282898
C  -6.540765 2.889983 1.488643
C  0.732266 -0.779126 -2.74197
C  -1.679757 1.32243 -0.767876
C  -1.705784 -0.38515 -2.963965
C  -2.862638 1.0722 -1.4431
C  -2.87656 0.219188 -2.539169
C  3.082131 -2.533662 -2.407691
C  4.151292 -3.022365 -3.330961
H  1.600643 -1.577317 4.519937
H  1.321475 0.078343 4.996511
H  -0.75418 -1.275048 4.495451
H  -0.288685 -1.337312 2.818191
H  3.198136 0.034116 3.506611
H  1.89709 0.823622 2.653621
H  -0.8892 1.180843 4.435455
H  -0.328299 1.215876 2.780507
H  2.616262 -2.131053 2.367766
H  1.438641 -1.305498 1.392389
H  -2.320025 -0.043516 2.030304
H  -2.895239 -0.167966 3.676506
H  3.671565 -1.703539 0.30698
H  4.417528 -0.633016 1.465103
H  -2.44132 2.479143 2.222233
H  -3.101446 2.300767 3.826652
H  4.078605 0.530204 -0.636443
H  3.122859 1.290369 0.614717
H  -4.378463 1.190068 1.283357
H  -5.043924 1.021218 2.887707
H  -4.544816 3.693003 1.494419
H  -5.236107 3.502113 3.085467
H  -7.035114 3.85733 1.39836
H  -6.490102 2.452782 0.489622
H  -7.183654 2.247183 2.091996
H  -1.664143 1.990333 0.082515
H  -1.703865 -1.045951 -3.819951
H  -3.77812 1.545981 -1.114013
H  -3.80267 0.028277 -3.064305
H  4.302041 -4.089315 -3.198373
H  5.090377 -2.494698 -3.169611
H  3.843302 -2.833279 -4.360171
totalener: -1234.87317853 hartree
nucrepener: 2702.31701869 hartree
electener: -3937.19019723 hartree
oneelecener: -7050.24843599 hartree
twoeener: 3113.05823876 hartree
kineticenergy: 1229.34052361 hartree
xcener: -121.319767479129 hartree
chargesum: 0.0000000
charge: -0.286029 -0.340210 -0.327708 -0.310103 -0.142207 -0.129200 -0.147943 -0.119267 -0.115027 -0.122989 -0.161479 -0.144772 -0.170649 -0.110165 -0.065586 -0.080921 0.212540 0.280867 -0.030713 -0.099352 -0.255312 0.329022 -0.153823 -0.065802 -0.076922 -0.124197 0.350869 -0.251673 0.071234 0.068606 0.073430 0.065453 0.068566 0.075976 0.061462 0.067048 0.079730 0.063555 0.056829 0.070924 0.091864 0.076298 0.059153 0.071700 0.100839 0.111830 0.034431 0.067487 0.051876 0.059232 0.086687 0.065652 0.074643 0.160769 0.136553 0.134179 0.133599 0.103730 0.101707 0.113709
qa: -0.2860 -0.3402 -0.3277 -0.3101 -0.1422 -0.1292 -0.1479 -0.1193 -0.1150 -0.1230 -0.1615 -0.1448 -0.1706 -0.1102 -0.0656 -0.0809 0.2125 0.2809 -0.0307 -0.0994 -0.2553 0.3290 -0.1538 -0.0658 -0.0769 -0.1242 0.3509 -0.2517 0.0712 0.0686 0.0734 0.0655 0.0686 0.0760 0.0615 0.0670 0.0797 0.0636 0.0568 0.0709 0.0919 0.0763 0.0592 0.0717 0.1008 0.1118 0.0344 0.0675 0.0519 0.0592 0.0867 0.0657 0.0746 0.1608 0.1366 0.1342 0.1336 0.1037 0.1017 0.1137
va: 2.1172 2.1289 2.1498 2.1778 3.9303 3.8757 3.8650 3.8552 3.8567 3.8656 3.9158 3.8731 3.8442 3.8656 3.6526 3.8745 3.7807 3.9924 3.7457 3.7985 3.9524 4.0824 3.9576 3.9528 3.9342 3.9924 4.1214 3.9083 1.0089 1.0098 1.0118 1.0084 1.0143 1.0127 1.0165 1.0166 1.0107 1.0154 1.0080 1.0144 1.0182 1.0136 1.0124 1.0152 1.0135 1.0164 1.0164 1.0146 1.0069 1.0097 1.0063 1.0034 1.0030 1.0026 1.0226 0.9980 1.0012 1.0143 1.0059 1.0047
dispcorr: -0.032860919 hartree
energy: -1234.906039452661
dipole: -21.57125 21.61793 0.04667 9.97206 -9.75880 0.21326 39.17428 -39.46754 -0.29326
magnitude: 0.36559 au
magnitude: 0.92926 debye
