program: Orca
programVersion: 5.0.2
elementType: O O O O C C C C C C C C C C C C C C C C C C C C C C C C H H H H H H H H H H H H H H H H H H H H H H H H H H H H H H H H
charge: 0
multiplicity: 1
keywords: wb97x-d3
keywords: def2-TZVPP
keywords: def2/J RIJCOSX
keywords: DEFGRID2
keywords: scfconv7
keywords: smallprint printgap noloewdin
keywords: NOSOSCF
formula: C24H32O4
InChI: InChI=1/C24H32O4/c1-3-4-5-6-7-8-9-10-11-12-17-21-22(26)19-15-13-14-16-20(19)23(27)24(21)28-18(2)25/h13-16H,3-12,17H2,1-2H3
60 atoms
O  2.159719 -1.817368 -1.826299
O  2.282997 2.691018 -0.580214
O  -0.375311 -1.432999 -2.563378
O  0.947222 -2.885018 -0.271211
C  1.463444 -1.014155 2.992218
C  0.266566 -0.15291 2.603738
C  2.758684 -0.23263 3.215424
C  -0.997951 -0.967152 2.365818
C  3.260985 0.515976 1.982501
C  -2.223872 -0.10716 2.085771
C  3.749547 -0.405874 0.863575
C  -3.476243 -0.936751 1.821427
C  3.690268 0.215065 -0.540507
C  -4.774087 -0.135056 1.814719
C  2.277013 0.383227 -1.013231
C  -4.867408 0.911363 0.712036
C  1.573046 -0.622369 -1.551259
C  1.634864 1.721073 -0.900103
C  0.17991 1.837591 -1.180217
C  -0.532095 0.761229 -1.706364
C  -6.193075 1.659148 0.722521
C  0.159202 -0.511448 -1.994267
C  -0.472139 3.038237 -0.92913
C  -1.886998 0.887872 -1.984528
C  -1.825643 3.157534 -1.197266
C  -2.531531 2.085583 -1.728047
C  1.66214 -2.933747 -1.223472
C  2.155088 -4.16413 -1.91489
H  1.608312 -1.784556 2.229832
H  1.222498 -1.556142 3.911895
H  0.485115 0.414189 1.693346
H  0.085726 0.59441 3.384987
H  3.535792 -0.917645 3.569645
H  2.603166 0.48737 4.024635
H  -0.827945 -1.653655 1.530979
H  -1.196309 -1.597479 3.239961
H  2.465739 1.171501 1.626619
H  4.072853 1.190419 2.266356
H  -2.402096 0.554303 2.941747
H  -2.020017 0.550061 1.233571
H  3.17439 -1.333741 0.86003
H  4.782628 -0.700141 1.066658
H  -3.553486 -1.712978 2.589452
H  -3.365079 -1.469474 0.870938
H  4.232061 -0.424167 -1.239165
H  4.191058 1.183325 -0.541152
H  -5.619245 -0.824389 1.719023
H  -4.897726 0.355247 2.786914
H  -4.727788 0.421416 -0.25741
H  -4.046424 1.627157 0.805881
H  -7.035352 0.977623 0.592854
H  -6.341695 2.18491 1.667146
H  -6.245636 2.400575 -0.075917
H  0.084487 3.872199 -0.524373
H  -2.427248 0.047282 -2.398251
H  -2.333425 4.091105 -0.995101
H  -3.588034 2.1844 -1.937884
H  1.945047 -5.04199 -1.311539
H  3.222726 -4.105533 -2.121367
H  1.642238 -4.263411 -2.872669
totalener: -1234.87103519 hartree
nucrepener: 2795.80814294 hartree
electener: -4030.67917813 hartree
oneelecener: -7237.43911781 hartree
twoeener: 3206.75993968 hartree
kineticenergy: 1229.34178741 hartree
xcener: -121.321974885496 hartree
chargesum: 0.0000000
charge: -0.286166 -0.320461 -0.326175 -0.332196 -0.118774 -0.069002 -0.154068 -0.146079 -0.152939 -0.077985 -0.141562 -0.101161 -0.127971 -0.133885 -0.031873 -0.079381 0.175397 0.268306 -0.081776 -0.091750 -0.254728 0.313279 -0.061923 -0.064484 -0.093332 -0.148351 0.379603 -0.251206 0.069832 0.071487 0.000777 0.065319 0.070716 0.070092 0.074275 0.056519 0.080642 0.084308 0.061787 0.015649 0.066043 0.085590 0.067398 0.063741 0.096247 0.101923 0.066742 0.055463 0.042175 0.049516 0.076710 0.076290 0.075472 0.135227 0.133138 0.134417 0.142871 0.104621 0.102286 0.113371
qa: -0.2862 -0.3205 -0.3262 -0.3322 -0.1188 -0.0690 -0.1541 -0.1461 -0.1529 -0.0780 -0.1416 -0.1012 -0.1280 -0.1339 -0.0319 -0.0794 0.1754 0.2683 -0.0818 -0.0918 -0.2547 0.3133 -0.0619 -0.0645 -0.0933 -0.1484 0.3796 -0.2512 0.0698 0.0715 0.0008 0.0653 0.0707 0.0701 0.0743 0.0565 0.0806 0.0843 0.0618 0.0156 0.0660 0.0856 0.0674 0.0637 0.0962 0.1019 0.0667 0.0555 0.0422 0.0495 0.0767 0.0763 0.0755 0.1352 0.1331 0.1344 0.1429 0.1046 0.1023 0.1134
va: 2.1191 2.1514 2.1530 2.1537 3.8879 3.8618 3.9345 3.9116 3.8777 3.8620 3.8802 3.8803 3.8525 3.9203 3.6700 3.8758 3.8017 3.9933 3.7047 3.6911 3.9598 4.0791 3.9725 3.8749 3.9350 3.9297 4.0725 3.9118 1.0193 1.0130 1.0311 1.0168 1.0081 1.0090 1.0214 1.0159 1.0069 1.0102 1.0136 1.0112 1.0262 1.0097 1.0130 1.0134 1.0146 1.0262 1.0123 1.0098 1.0055 1.0035 1.0040 1.0030 1.0064 1.0238 1.0260 1.0004 0.9922 1.0141 1.0058 1.0047
dispcorr: -0.035639381 hartree
energy: -1234.906674568667
dipole: -19.83167 19.88941 0.05775 -3.07398 3.01142 -0.06256 29.43580 -29.76499 -0.32918
magnitude: 0.34002 au
magnitude: 0.86425 debye
