program: Orca
programVersion: 5.0.2
elementType: O O O O C C C C C C C C C C C C C C C C C C C C C C C C H H H H H H H H H H H H H H H H H H H H H H H H H H H H H H H H
charge: 0
multiplicity: 1
keywords: wb97x-d3
keywords: def2-TZVPP
keywords: def2/J RIJCOSX
keywords: DEFGRID2
keywords: scfconv7
keywords: smallprint printgap noloewdin
keywords: NOSOSCF
formula: C24H32O4
InChI: InChI=1/C24H32O4/c1-3-4-5-6-7-8-9-10-11-12-17-21-22(26)19-15-13-14-16-20(19)23(27)24(21)28-18(2)25/h13-16H,3-12,17H2,1-2H3
60 atoms
O  2.524923 -1.239338 1.45911
O  2.087285 2.310201 -1.579656
O  0.089415 -0.654446 2.345479
O  2.958446 -0.083315 3.32838
C  0.517299 -2.845988 -1.977038
C  -0.97565 -2.661604 -2.23629
C  1.359051 -1.629229 -2.339917
C  -1.619898 -1.571939 -1.385579
C  2.847163 -1.812584 -2.053154
C  -3.115724 -1.419426 -1.626351
C  3.644284 -0.506338 -2.078244
C  -3.725924 -0.281631 -0.818927
C  3.727986 0.213499 -0.721641
C  -5.212943 -0.081792 -1.081536
C  2.403065 0.52371 -0.098107
C  -5.821198 1.102995 -0.336188
C  1.883054 -0.163978 0.926815
C  1.627542 1.65649 -0.671187
C  0.2926 1.974506 -0.100147
C  -0.228178 1.224663 0.953146
C  -5.841807 0.9364 1.177512
C  0.532952 0.080937 1.495889
C  -0.438138 3.037694 -0.616657
C  -1.47127 1.538976 1.48689
C  -1.675866 3.350163 -0.07924
C  -2.190384 2.60444 0.97347
C  2.92972 -1.128299 2.758159
C  3.320499 -2.46694 3.298244
H  0.878452 -3.715097 -2.535989
H  0.671995 -3.083765 -0.918462
H  -1.490247 -3.609148 -2.049279
H  -1.13617 -2.437107 -3.296528
H  0.982987 -0.761829 -1.79584
H  1.223019 -1.387815 -3.399449
H  -1.440793 -1.785552 -0.325459
H  -1.139664 -0.608154 -1.58152
H  2.978749 -2.304692 -1.0841
H  3.261322 -2.506123 -2.790155
H  -3.294623 -1.244451 -2.693015
H  -3.626395 -2.357962 -1.385222
H  3.233474 0.169726 -2.831058
H  4.673464 -0.705245 -2.385289
H  -3.19202 0.647189 -1.048418
H  -3.550986 -0.468966 0.244969
H  4.276231 1.147597 -0.857737
H  4.315834 -0.39891 -0.038043
H  -5.365656 0.059266 -2.156106
H  -5.7589 -0.994452 -0.818064
H  -6.843864 1.259602 -0.68911
H  -5.271304 2.012707 -0.59879
H  -6.329693 1.781749 1.663931
H  -6.385204 0.035059 1.466404
H  -4.836998 0.855032 1.594464
H  -0.030075 3.615759 -1.434332
H  -1.866087 0.947511 2.301747
H  -2.242027 4.180055 -0.480603
H  -3.158629 2.850461 1.389075
H  2.422073 -3.067017 3.449452
H  3.83113 -2.352204 4.249443
H  3.959274 -3.006921 2.600543
totalener: -1234.87025447 hartree
nucrepener: 2777.30521646 hartree
electener: -4012.17547093 hartree
oneelecener: -7200.13746823 hartree
twoeener: 3187.96199730 hartree
kineticenergy: 1229.35037671 hartree
xcener: -121.323157492847 hartree
chargesum: 0.0000000
charge: -0.299588 -0.325847 -0.330451 -0.310754 -0.133201 -0.142380 -0.062391 -0.059857 -0.149274 -0.166473 -0.157136 -0.072808 -0.133175 -0.117613 -0.103216 -0.102392 0.256587 0.396955 -0.142375 -0.077879 -0.262569 0.276759 -0.088244 -0.069164 -0.083358 -0.145378 0.352296 -0.250985 0.075535 0.061294 0.069636 0.058531 -0.013675 0.078171 0.064631 0.045964 0.061198 0.084336 0.054884 0.059405 0.091641 0.082562 0.042853 0.059156 0.101431 0.087642 0.063982 0.058411 0.075544 0.045967 0.089727 0.083730 0.055878 0.136485 0.137385 0.133518 0.139326 0.113599 0.104489 0.100676
qa: -0.2996 -0.3258 -0.3305 -0.3108 -0.1332 -0.1424 -0.0624 -0.0599 -0.1493 -0.1665 -0.1571 -0.0728 -0.1332 -0.1176 -0.1032 -0.1024 0.2566 0.3970 -0.1424 -0.0779 -0.2626 0.2768 -0.0882 -0.0692 -0.0834 -0.1454 0.3523 -0.2510 0.0755 0.0613 0.0696 0.0585 -0.0137 0.0782 0.0646 0.0460 0.0612 0.0843 0.0549 0.0594 0.0916 0.0826 0.0429 0.0592 0.1014 0.0876 0.0640 0.0584 0.0755 0.0460 0.0897 0.0837 0.0559 0.1365 0.1374 0.1335 0.1393 0.1136 0.1045 0.1007
va: 2.0703 2.1599 2.1388 2.1880 3.9092 3.9511 3.8184 3.8485 3.8736 3.9944 3.8816 3.8657 3.8727 3.9057 3.7918 3.8798 3.6308 3.8764 3.7704 3.6789 3.9294 4.0522 3.9974 3.8563 3.9268 3.9243 4.1369 3.9018 1.0106 1.0134 1.0124 1.0103 1.0559 1.0156 1.0121 1.0078 1.0185 1.0087 1.0105 1.0123 1.0160 1.0072 1.0087 1.0074 1.0184 1.0181 1.0124 1.0105 1.0098 1.0121 1.0038 1.0078 1.0042 1.0253 1.0264 1.0009 0.9941 1.0036 1.0146 1.0051
dispcorr: -0.035412641 hartree
energy: -1234.905667114895
dipole: -28.67455 28.33065 -0.34390 -16.79486 16.34837 -0.44650 -17.69689 17.33414 -0.36275
magnitude: 0.67024 au
magnitude: 1.70360 debye
