program: Gaussian 09
title: 000054940
version: EM64L-G09RevD.01
frameworkgroup: C1[X(C16H23BrN2O3)]
method: RPBEPBE
basis: SDD
operation: Freq
keyword: #p
keyword: freq=noraman
keyword: PBEPBE/SDD
title: #p freq=noraman PBEPBE/SDD
converged: YES YES NO NO
title: Mulliken charges:
elementType: Br O O O N N C C C C C C C C C C C C C C C C H H H H H H H H H H H H H H H H H H H H H H H
charge: 0.024695 -0.281070 -0.315675 -0.286868 -0.129000 -0.329140 -0.000340 -0.460272 -0.474070 -0.365213 -0.466489 -0.328883 -0.697093 0.135821 0.043504 0.391257 0.218367 -0.429612 -0.374522 -0.174086 -0.507281 -0.521524 0.237878 0.205384 0.213501 0.220911 0.223135 0.229136 0.174636 0.237546 0.252820 0.230885 0.179363 0.342834 0.211246 0.225612 0.218310 0.257036 0.252413 0.234912 0.232460 0.241042 0.275057 0.228832 0.202544
chargesum: 0.00000
title: Mulliken charges with hydrogens summed into heavy atoms:
elementType: Br O O O N N C C C C C C C C C C C C C C C C
charge: 0.024695 -0.281070 -0.315675 -0.286868 -0.129000 0.013694 0.237538 -0.041388 -0.030024 0.038559 0.023877 0.081366 -0.041925 0.135821 0.043504 0.391257 0.218367 -0.429612 -0.117486 0.078327 0.201133 0.184909
polarizability: 2.77083798e+02 8.90507161e+00 2.48223629e+02 -1.14133794e+00 2.07017186e+00 1.32934416e+02
1716.lowfreq: -9.4811 -4.0580 -2.0152 0.0004 0.0007 0.0009 11.0130 21.4701 29.3548
frequency: 10.6238 21.2297 29.3208 45.5186 58.8853 62.6334 66.3828 71.4515 84.1086 104.0359 119.0120 140.1099 143.6215 155.4182 158.2526 190.6871 196.4827 209.8091 232.7420 242.8616 258.0906 271.0003 278.9615 293.6471 340.0274 344.7457 348.7863 370.5374 422.0133 429.5793 482.8487 503.8293 538.5492 560.4889 567.9101 602.5871 607.9682 612.4486 662.8332 702.1273 718.6875 784.6963 790.7134 792.7668 820.5707 826.6350 829.9150 856.6816 879.3115 902.7107 933.2708 942.9702 948.9584 958.8324 974.7796 1007.6270 1010.7990 1029.6910 1071.9894 1090.6858 1095.5801 1103.4899 1108.6903 1111.6633 1121.4569 1145.5474 1149.2213 1152.4460 1155.2470 1162.9228 1190.3159 1191.5062 1205.1221 1226.9197 1229.1150 1247.9846 1263.7579 1280.2376 1294.8214 1298.7113 1310.3682 1338.0927 1338.3806 1342.1707 1356.0796 1364.5523 1378.0276 1387.6113 1407.4655 1436.5419 1438.6970 1443.1980 1449.8712 1458.4836 1462.8947 1464.9673 1467.6233 1472.7667 1475.4782 1484.3368 1485.9013 1495.6916 1507.0530 1549.8218 1574.5865 1591.7549 2835.5681 2843.7615 2913.5116 2963.7789 2973.1417 2983.8314 2994.8522 3010.4853 3021.5411 3023.0483 3035.5534 3051.7709 3071.2259 3076.4399 3079.1554 3082.8919 3088.8485 3092.1664 3126.4247 3127.5212 3155.9739 3176.5642 3519.6383
redmass: 3.8335 4.2896 4.6696 3.7897 4.2076 2.7629 3.1885 4.7167 3.0188 3.2269 3.5574 4.6924 1.1269 1.5683 1.3946 3.9323 4.1066 3.3146 2.3973 1.6129 8.7319 2.9776 3.6211 4.6036 4.4885 2.8513 4.8647 3.4912 3.3863 4.4795 3.6784 4.4438 6.4149 3.3776 3.2772 2.6283 1.2612 5.2401 4.3162 6.9272 5.0485 3.7590 1.5309 1.9712 1.8266 1.8147 3.4197 6.2134 2.3114 1.9741 2.2779 4.0246 1.6703 2.0652 2.2208 2.3538 2.5381 4.2354 2.1271 2.2029 1.9984 2.4361 1.2914 1.2442 2.0852 1.6379 1.7819 1.3566 1.4712 1.5108 1.8933 2.0060 2.6225 1.3562 4.0383 1.3045 2.4259 1.2174 1.2736 1.3519 1.2949 7.0936 1.3929 1.4156 1.4710 3.4187 1.3183 1.2976 1.5679 1.2317 1.1352 1.6333 1.0978 1.0592 1.0846 1.0579 1.0457 1.0649 1.0908 1.0565 1.0699 1.0918 1.7816 6.9740 8.1806 6.7071 1.0721 1.0710 1.0835 1.0339 1.0311 1.0354 1.0604 1.0645 1.0605 1.0875 1.0877 1.1012 1.1045 1.0992 1.0989 1.1047 1.1004 1.1044 1.1037 1.1023 1.0882 1.0974 1.0783
irintensity: 0.2309 0.0640 0.5558 0.0520 4.5253 0.6546 2.4790 1.6219 7.7691 8.9364 2.7430 1.4902 0.3651 0.4120 0.7646 8.0186 3.3211 3.4525 1.2925 3.1984 0.0126 10.9945 0.6880 2.0493 17.3938 2.4441 3.9541 2.1865 0.5612 23.3411 7.4461 12.6703 12.1111 4.8950 1.6662 1.6427 114.2233 20.7033 23.2600 3.9437 18.0311 3.1788 6.8240 9.9621 10.2670 28.3785 7.2472 4.8608 2.9193 4.6826 17.8748 35.3055 13.1352 1.5216 13.7627 12.6260 45.0617 69.4796 28.6525 3.0089 20.5863 18.3247 13.8006 0.3633 5.6075 0.5818 29.8780 1.5521 1.4046 19.0147 48.9919 22.4971 39.4192 5.8709 46.9308 23.0652 153.9762 11.6574 15.4660 6.0933 0.4986 2.2994 6.6895 3.8891 17.1908 38.3854 1.5452 22.0918 19.2962 8.4433 21.4928 69.6938 20.3767 18.6899 4.0912 17.4218 10.4393 11.0162 1.6850 10.9622 4.3575 11.5700 262.9851 24.4569 24.1829 195.3913 54.7311 177.0615 48.3617 89.8950 43.4332 34.7170 49.5020 24.9541 34.4576 18.7677 56.0146 27.2586 32.5559 22.5707 50.3053 47.1129 43.4442 8.6106 21.0149 19.6388 2.2696 4.6927 33.5416
temp: 298.150 k
press: 1.00000 atm
elementType: 35 8 8 8 7 7 6 6 6 6 6 6 6 6 6 6 6 6 6 6 6 6 1 1 1 1 1 1 1 1 1 1 1 1 1 1 1 1 1 1 1 1 1 1 1
symmnumber: 1
zpe: 964066.5 jmol-1
zpe.correction: 0.367194 hartree
zpe.thermalcorrener: 0.391446 hartree
zpe.thermalcorrenthalpy: 0.392390 hartree
zpe.thermalcorrgfe: 0.309315 hartree
zpe.sumelectzpe: -970.407020 hartree
zpe.sumelectthermal: -970.382768 hartree
zpe.sumelectthermalent: -970.381823 hartree
zpe.sumelectthermalfe: -970.464899 hartree
dipole: 0.5065 -1.5992 1.9080
dipole: 2.5406
quadrupole: -134.2297 -135.1574 -141.6890
quadrupole: -12.6561 -1.8789 1.9565
quadrupole: 2.7957 1.8679 -4.6636 -12.6561 -1.8789 1.9565
hfenergy: -970.7742134 hartree
pointgroup: C01 [X(C16H23Br1N2O3)]
dipole: 0.2861306 0.6705933 -0.6837663 debye
polarizability: 273.5152286|-12.8300406|249.8154812|-2.2261825|15.3824038|134.9111327 unknown
InChI: InChI=1S/C16H23BrN2O3/c1-4-19-9-5-6-11(19)10-18-16(20)14-13(21-2)8-7-12(17)15(14)22-3/h7-8,11,18H,4-6,9-10H2,1-3H3
charge 0 multiplicity 1
45 atoms
Br -4.412127 2.909875 0.264585
O  0.041283 -1.750381 -0.646489
O  -1.46588 1.862616 0.414524
O  -2.454846 -2.942914 0.315398
N  4.036973 -0.042532 -0.0203
N  0.383157 -0.173584 1.028088
C  2.626548 0.447762 0.032661
C  2.734886 1.962607 0.386454
C  4.200493 2.145852 0.864143
C  4.958406 1.119491 -0.001426
C  1.838111 -0.391891 1.077867
C  4.302189 -1.079512 -1.039105
C  5.640574 -1.805833 -0.811772
C  -0.42025 -0.870565 0.152164
C  -1.9027 -0.546236 0.202174
C  -2.381055 0.797075 0.247139
C  -2.858277 -1.605058 0.173373
C  -3.770748 1.061393 0.203113
C  -4.24343 -1.322398 0.137538
C  -4.705206 0.008979 0.144663
C  -0.954549 2.44811 -0.84724
C  -2.291443 -3.717798 -0.936923
H  2.114982 0.313557 -0.947814
H  2.557968 2.577352 -0.516004
H  1.994655 2.271288 1.147273
H  4.301179 1.878213 1.931644
H  4.571416 3.176254 0.728234
H  5.938796 0.843229 0.425854
H  5.13729 1.533939 -1.027596
H  2.203354 -0.152579 2.092416
H  2.026515 -1.46144 0.885043
H  3.476324 -1.814191 -0.997108
H  4.287651 -0.642348 -2.072144
H  -0.031999 0.619461 1.524669
H  5.770361 -2.614834 -1.553813
H  5.667563 -2.247528 0.20008
H  6.500077 -1.118241 -0.911033
H  -4.950545 -2.157381 0.142905
H  -5.776651 0.227124 0.126271
H  -0.293799 3.272734 -0.541458
H  -0.383698 1.692492 -1.419564
H  -1.790089 2.837999 -1.455863
H  -1.435189 -3.313532 -1.502441
H  -2.088903 -4.749449 -0.61195
H  -3.221268 -3.686877 -1.539226
