program: Orca
programVersion: 5.0.2
elementType: O O O O C C C C C C C C C C C C C C C C C C C C C C C C H H H H H H H H H H H H H H H H H H H H H H H H H H H H H H H H
charge: 0
multiplicity: 1
keywords: wb97x-d3
keywords: def2-TZVPP
keywords: def2/J RIJCOSX
keywords: DEFGRID2
keywords: scfconv7
keywords: smallprint printgap noloewdin
keywords: NOSOSCF
formula: C24H32O4
InChI: InChI=1/C24H32O4/c1-3-4-5-6-7-8-9-10-11-12-17-21-22(26)19-15-13-14-16-20(19)23(27)24(21)28-18(2)25/h13-16H,3-12,17H2,1-2H3
60 atoms
O  1.650116 -1.815052 -1.894595
O  2.774123 2.500581 -0.476797
O  -0.773486 -0.875466 -2.494278
O  0.335544 -2.661027 -0.288689
C  1.258899 -0.782898 2.882901
C  -0.179068 -0.451981 3.274324
C  2.023314 0.410526 2.323587
C  -1.087358 -0.099854 2.099494
C  3.477432 0.115908 1.957365
C  -2.527123 0.147383 2.5342
C  3.707728 -0.835504 0.780961
C  -3.471638 0.522529 1.394976
C  3.624754 -0.202282 -0.617976
C  -3.651581 -0.55113 0.322295
C  2.258515 0.270943 -1.004304
C  -4.150851 -1.900835 0.831404
C  1.339937 -0.535876 -1.551399
C  1.923648 1.708712 -0.81211
C  0.520013 2.144367 -1.030754
C  -0.420316 1.270148 -1.573018
C  -5.495225 -1.835865 1.54273
C  -0.030339 -0.10938 -1.927724
C  0.147069 3.441404 -0.701865
C  -1.723253 1.696047 -1.795481
C  -1.158014 3.856777 -0.907436
C  -2.091619 2.98631 -1.455335
C  0.973247 -2.824859 -1.282296
C  1.172642 -4.110413 -2.018892
H  1.24389 -1.59899 2.155585
H  1.791599 -1.163957 3.760304
H  -0.181003 0.370044 3.999042
H  -0.607446 -1.312684 3.797127
H  2.014616 1.213182 3.067562
H  1.481841 0.810431 1.465794
H  -0.717581 0.793805 1.585408
H  -1.044076 -0.910962 1.367145
H  3.997601 1.056694 1.757868
H  3.964506 -0.310369 2.83987
H  -2.905622 -0.738119 3.056059
H  -2.539386 0.951207 3.277116
H  3.027625 -1.688624 0.842183
H  4.713644 -1.253786 0.867533
H  -3.101705 1.434617 0.915731
H  -4.446957 0.785092 1.815302
H  3.964967 -0.938274 -1.347964
H  4.31958 0.636246 -0.67004
H  -4.354855 -0.175385 -0.428904
H  -2.709102 -0.708743 -0.208237
H  -3.404447 -2.346095 1.495138
H  -4.226784 -2.582288 -0.019643
H  -6.25797 -1.382727 0.906334
H  -5.84599 -2.831419 1.816089
H  -5.444441 -1.248805 2.460757
H  0.881586 4.116851 -0.285406
H  -2.442341 1.01136 -2.223643
H  -1.448863 4.864434 -0.642353
H  -3.109016 3.315869 -1.618065
H  0.81009 -4.942821 -1.423521
H  2.220105 -4.26735 -2.272139
H  0.612637 -4.075175 -2.954476
totalener: -1234.86897333 hartree
nucrepener: 2844.66886626 hartree
electener: -4079.53783958 hartree
oneelecener: -7335.36784150 hartree
twoeener: 3255.83000192 hartree
kineticenergy: 1229.34735819 hartree
xcener: -121.327832990354 hartree
chargesum: 0.0000000
charge: -0.286811 -0.323184 -0.325689 -0.336033 -0.130159 -0.143063 -0.044351 -0.085935 -0.168829 -0.138512 -0.154230 -0.143840 -0.137459 -0.136860 -0.074011 -0.107093 0.197909 0.349411 -0.119638 -0.057684 -0.255984 0.296218 -0.076167 -0.109859 -0.082032 -0.124088 0.380268 -0.249572 0.069457 0.068459 0.057505 0.068624 0.077821 -0.012075 0.038204 0.066597 0.085426 0.076505 0.063119 0.071806 0.070871 0.083831 0.060031 0.088457 0.095447 0.103049 0.071148 0.055397 0.060431 0.069770 0.075011 0.085915 0.070694 0.134472 0.139439 0.134446 0.137158 0.105012 0.101988 0.113261
qa: -0.2868 -0.3232 -0.3257 -0.3360 -0.1302 -0.1431 -0.0444 -0.0859 -0.1688 -0.1385 -0.1542 -0.1438 -0.1375 -0.1369 -0.0740 -0.1071 0.1979 0.3494 -0.1196 -0.0577 -0.2560 0.2962 -0.0762 -0.1099 -0.0820 -0.1241 0.3803 -0.2496 0.0695 0.0685 0.0575 0.0686 0.0778 -0.0121 0.0382 0.0666 0.0854 0.0765 0.0631 0.0718 0.0709 0.0838 0.0600 0.0885 0.0954 0.1030 0.0711 0.0554 0.0604 0.0698 0.0750 0.0859 0.0707 0.1345 0.1394 0.1344 0.1372 0.1050 0.1020 0.1133
va: 2.1213 2.1544 2.1495 2.1579 3.8914 3.9483 3.8467 3.8586 3.9270 3.9159 3.8960 3.8635 3.8428 3.8918 3.6683 3.9134 3.7880 3.9318 3.7386 3.6281 3.9367 4.0786 3.9783 3.9145 3.9457 3.9294 4.0765 3.9095 1.0218 1.0148 1.0113 1.0114 1.0147 1.0514 1.0140 1.0179 1.0132 1.0066 1.0064 1.0112 1.0202 1.0083 1.0222 1.0010 1.0149 1.0261 1.0069 1.0096 1.0059 1.0089 1.0025 1.0079 1.0014 1.0255 1.0185 0.9991 1.0003 1.0138 1.0056 1.0045
dispcorr: -0.037619675 hartree
energy: -1234.906593000420
dipole: -18.55184 18.67497 0.12313 -11.81410 11.79630 -0.01780 28.35876 -28.72402 -0.36526
magnitude: 0.38586 au
magnitude: 0.98079 debye
