program: Orca
programVersion: 5.0.2
elementType: Cl O N N N C C C C C C C C C C C C C C C C C C H H H H H H H H H H H H H H H H H H H H H H H H
charge: 0
multiplicity: 1
keywords: wb97x-d3
keywords: def2-TZVPP
keywords: def2/J RIJCOSX
keywords: DEFGRID2
keywords: scfconv7
keywords: smallprint printgap noloewdin
keywords: NOSOSCF
formula: C18H24ClN3O
InChI: InChI=1/C18H24ClN3O/c1-6-14-15(19)16(22(5)21-14)17(23)20-11-12-7-9-13(10-8-12)18(2,3)4/h7-10,20H,6,11H2,1-5H3
47 atoms
Cl -1.32012 -1.516363 0.929263
O  -1.218124 2.144148 -1.581617
N  -0.720684 1.763147 0.594498
N  -3.768958 0.799145 -0.923533
N  -4.57606 -0.234404 -0.726467
C  5.038004 -1.128066 -0.305927
C  3.876138 -0.162439 -0.099412
C  6.249967 -0.65399 0.50537
C  5.453573 -1.231392 -1.771972
C  4.619842 -2.522138 0.176859
C  3.243301 0.499861 -1.148443
C  3.399646 0.083572 1.191309
C  1.715199 1.604678 0.364481
C  2.181332 1.368669 -0.922161
C  2.341955 0.94737 1.419706
C  0.532277 2.499369 0.621421
C  -2.546136 0.600033 -0.389244
C  -3.882131 -1.151035 -0.073867
C  -1.432623 1.569882 -0.518836
C  -2.590747 -0.663356 0.164297
C  -4.46215 -2.458313 0.339941
C  -4.2708 1.989811 -1.577847
C  -4.787779 -2.507203 1.830294
H  7.092438 -1.333413 0.359855
H  6.569882 0.342752 0.195402
H  6.041321 -0.619955 1.575423
H  4.648881 -1.611767 -2.403753
H  5.775521 -0.270671 -2.178003
H  6.293196 -1.922052 -1.866157
H  4.351132 -2.524413 1.234262
H  3.761852 -2.894756 -0.385805
H  5.438797 -3.232593 0.044815
H  3.571944 0.351042 -2.168046
H  3.859466 -0.406204 2.041086
H  1.718419 1.868483 -1.764612
H  2.000477 1.116199 2.434628
H  0.61531 2.96327 1.603274
H  0.483961 3.305625 -0.108085
H  -0.957097 1.23982 1.423598
H  -5.366603 -2.641405 -0.241334
H  -3.763406 -3.260176 0.091317
H  -5.300297 1.8001 -1.861206
H  -4.241973 2.842396 -0.903279
H  -3.697792 2.217841 -2.471079
H  -5.212389 -3.474645 2.098417
H  -5.512121 -1.738249 2.09954
H  -3.897563 -2.356467 2.441422
elementType: Cl O N C H
totalener: -1400.17405135 hartree
nucrepener: 2055.93306885 hartree
electener: -3456.10712020 hartree
oneelecener: -5996.92294994 hartree
twoeener: 2540.81582973 hartree
cpcmener: -0.03202133 hartree
kineticenergy: 1395.24611611 hartree
xcener: -114.418203909139 hartree
chargesum: 0.0000000
charge: -0.076559 -0.541640 -0.172633 0.143028 -0.341613 0.339144 -0.102373 -0.328018 -0.358243 -0.328942 -0.189829 -0.173190 -0.015608 -0.140195 -0.231711 -0.001722 0.071603 0.088637 0.302737 -0.067403 -0.136397 -0.171980 -0.251872 0.097114 0.101459 0.097204 0.099910 0.102391 0.100466 0.096978 0.101211 0.097722 0.147415 0.143038 0.138877 0.143471 0.125641 0.114358 0.185064 0.080690 0.084176 0.111504 0.134776 0.120224 0.093326 0.089862 0.077902
qa: -0.0766 -0.5416 -0.1726 0.1430 -0.3416 0.3391 -0.1024 -0.3280 -0.3582 -0.3289 -0.1898 -0.1732 -0.0156 -0.1402 -0.2317 -0.0017 0.0716 0.0886 0.3027 -0.0674 -0.1364 -0.1720 -0.2519 0.0971 0.1015 0.0972 0.0999 0.1024 0.1005 0.0970 0.1012 0.0977 0.1474 0.1430 0.1389 0.1435 0.1256 0.1144 0.1851 0.0807 0.0842 0.1115 0.1348 0.1202 0.0933 0.0899 0.0779
va: 1.2451 1.9572 3.2440 3.3662 2.9520 3.6137 3.7261 3.9161 3.9276 3.9184 3.9503 3.9715 3.6065 3.9545 4.0132 3.8138 3.8027 3.8850 4.2107 3.9843 3.9099 3.8716 3.9109 1.0037 1.0032 1.0044 1.0005 1.0006 1.0067 1.0039 1.0039 1.0034 0.9980 1.0011 1.0192 1.0029 1.0026 1.0188 1.0106 1.0199 1.0048 1.0111 0.9834 1.0012 1.0063 1.0032 1.0090
dispcorr: -0.022743434 hartree
energy: -1400.196794785827
dipole: 24.00019 -23.53839 0.46180 -6.70322 6.79473 0.09151 0.45440 1.21827 1.67267
magnitude: 1.73766 au
magnitude: 4.41678 debye
