program: Orca
programVersion: 5.0.2
elementType: Cl O N N N C C C C C C C C C C C C C C C C C C H H H H H H H H H H H H H H H H H H H H H H H H
charge: 0
multiplicity: 1
keywords: wb97x-d3
keywords: def2-TZVPP
keywords: def2/J RIJCOSX
keywords: DEFGRID2
keywords: scfconv7
keywords: smallprint printgap noloewdin
keywords: NOSOSCF
formula: C18H24ClN3O
InChI: InChI=1/C18H24ClN3O/c1-6-14-15(19)16(22(5)21-14)17(23)20-11-12-7-9-13(10-8-12)18(2,3)4/h7-10,20H,6,11H2,1-5H3
47 atoms
Cl -1.488206 -1.434062 1.080292
O  -1.507329 2.225163 -1.54558
N  -0.647409 1.701228 0.487341
N  -3.972598 0.999706 -0.567325
N  -4.814779 0.026203 -0.253883
C  5.272212 -1.117519 -0.393026
C  4.038799 -0.239017 -0.218013
C  5.741821 -1.604077 0.983197
C  6.392645 -0.30357 -1.050695
C  4.993379 -2.339732 -1.266128
C  4.127871 0.94807 0.513207
C  2.792183 -0.564315 -0.746175
C  1.786882 1.436057 0.162912
C  3.027008 1.766391 0.702084
C  1.684956 0.25584 -0.560279
C  0.621545 2.37598 0.346257
C  -2.708344 0.724977 -0.182398
C  -4.110385 -0.923495 0.337981
C  -1.566251 1.61927 -0.480781
C  -2.771558 -0.52114 0.410514
C  -4.71425 -2.202692 0.801478
C  -4.473111 2.192187 -1.219721
C  -4.390704 -3.373409 -0.123073
H  4.968495 -2.192874 1.480125
H  6.62653 -2.236225 0.881287
H  6.005302 -0.775549 1.642397
H  6.684749 0.558221 -0.448982
H  7.281705 -0.923398 -1.184592
H  6.092244 0.063069 -2.034037
H  4.235023 -2.993331 -0.83152
H  4.664554 -2.062251 -2.269303
H  5.905441 -2.928991 -1.373909
H  5.07179 1.242927 0.955556
H  2.659342 -1.472682 -1.318085
H  3.133802 2.676138 1.281841
H  0.737955 -0.045827 -0.991131
H  0.786515 2.991574 1.231048
H  0.556116 3.063948 -0.496059
H  -0.780718 1.166241 1.33229
H  -4.361353 -2.425099 1.810892
H  -5.795307 -2.075254 0.869753
H  -5.552999 2.194522 -1.113247
H  -4.074672 3.085077 -0.745824
H  -4.22128 2.199402 -2.277488
H  -3.316919 -3.550299 -0.187483
H  -4.761183 -3.191995 -1.132181
H  -4.854277 -4.289385 0.243307
elementType: Cl O N C H
totalener: -1400.17443523 hartree
nucrepener: 2040.80966529 hartree
electener: -3440.98410051 hartree
oneelecener: -5966.29199656 hartree
twoeener: 2525.30789605 hartree
cpcmener: -0.03102732 hartree
kineticenergy: 1395.24375615 hartree
xcener: -114.421257995872 hartree
chargesum: -0.0000000
charge: -0.077991 -0.543476 -0.180315 0.145066 -0.335535 0.331303 -0.095148 -0.327008 -0.329078 -0.357095 -0.172901 -0.155428 0.026011 -0.234931 -0.222551 0.026058 0.063034 0.093897 0.299336 -0.060874 -0.140079 -0.171320 -0.254129 0.101473 0.096852 0.096850 0.097203 0.097063 0.101599 0.099745 0.102203 0.100427 0.142965 0.144924 0.142322 0.145579 0.119078 0.105111 0.186216 0.085060 0.081906 0.113123 0.129514 0.122157 0.078393 0.090253 0.093138
qa: -0.0780 -0.5435 -0.1803 0.1451 -0.3355 0.3313 -0.0951 -0.3270 -0.3291 -0.3571 -0.1729 -0.1554 0.0260 -0.2349 -0.2226 0.0261 0.0630 0.0939 0.2993 -0.0609 -0.1401 -0.1713 -0.2541 0.1015 0.0969 0.0968 0.0972 0.0971 0.1016 0.0997 0.1022 0.1004 0.1430 0.1449 0.1423 0.1456 0.1191 0.1051 0.1862 0.0851 0.0819 0.1131 0.1295 0.1222 0.0784 0.0903 0.0931
va: 1.2437 1.9534 3.2445 3.3750 2.9526 3.6225 3.7215 3.9176 3.9174 3.9256 3.9817 3.9345 3.6571 4.0528 3.9690 3.8354 3.8338 3.8769 4.1898 3.9789 3.9073 3.8799 3.9131 1.0037 1.0036 1.0040 1.0043 1.0035 1.0034 1.0009 1.0010 1.0068 1.0016 1.0010 1.0023 1.0089 0.9990 1.0216 1.0111 1.0044 1.0192 1.0107 0.9892 0.9928 1.0088 1.0031 1.0062
dispcorr: -0.022643010 hartree
energy: -1400.197078234910
dipole: 27.39454 -26.64856 0.74598 -8.48038 8.54178 0.06141 -4.61410 6.10118 1.48709
magnitude: 1.66484 au
magnitude: 4.23168 debye
