program: Orca
programVersion: 5.0.2
elementType: Cl O N N N C C C C C C C C C C C C C C C C C C H H H H H H H H H H H H H H H H H H H H H H H H
charge: 0
multiplicity: 1
keywords: wb97x-d3
keywords: def2-TZVPP
keywords: def2/J RIJCOSX
keywords: DEFGRID2
keywords: scfconv7
keywords: smallprint printgap noloewdin
keywords: NOSOSCF
formula: C18H24ClN3O
InChI: InChI=1/C18H24ClN3O/c1-6-14-15(19)16(22(5)21-14)17(23)20-11-12-7-9-13(10-8-12)18(2,3)4/h7-10,20H,6,11H2,1-5H3
47 atoms
Cl -1.629075 -1.41186 1.267587
O  -1.385915 2.276244 -1.399098
N  -0.659509 1.634725 0.64755
N  -3.882623 0.950575 -0.775658
N  -4.750696 -0.021348 -0.544823
C  5.250769 -1.07423 -0.415988
C  4.05263 -0.182246 -0.111491
C  6.42197 -0.816336 0.530602
C  5.724556 -0.811173 -1.85068
C  4.833872 -2.544077 -0.279754
C  2.892089 -0.290061 -0.884506
C  4.043795 0.756361 0.914723
C  1.785355 1.441929 0.381175
C  1.78236 0.500721 -0.646856
C  2.928003 1.551201 1.158615
C  0.60088 2.342999 0.627243
C  -2.678642 0.705617 -0.21345
C  -4.127865 -0.942601 0.1689
C  -1.519221 1.613135 -0.379536
C  -2.814024 -0.522831 0.407534
C  -4.785033 -2.213385 0.582797
C  -4.309503 2.099313 -1.547005
C  -4.347059 -3.404494 -0.265487
H  7.255001 -1.472679 0.272306
H  6.787716 0.210242 0.465638
H  6.163691 -1.016742 1.572331
H  6.58426 -1.440857 -2.090864
H  4.948396 -1.0271 -2.586453
H  6.028187 0.229043 -1.984554
H  4.479022 -2.764323 0.72915
H  4.037811 -2.812149 -0.976139
H  5.681002 -3.202543 -0.484898
H  2.847626 -1.005629 -1.696859
H  4.908639 0.882622 1.551952
H  0.911817 0.383932 -1.281396
H  2.95776 2.26775 1.971883
H  0.720514 2.859064 1.580567
H  0.547818 3.115341 -0.140093
H  -0.850718 1.077226 1.465234
H  -4.565717 -2.411485 1.634568
H  -5.866181 -2.085592 0.508234
H  -3.872109 2.090702 -2.542733
H  -5.390504 2.043196 -1.633439
H  -4.045279 3.026386 -1.044527
H  -3.273076 -3.578526 -0.192082
H  -4.589246 -3.249842 -1.317378
H  -4.850902 -4.31429 0.06253
elementType: Cl O N C H
totalener: -1400.18450457 hartree
nucrepener: 2039.17345445 hartree
electener: -3439.35795902 hartree
oneelecener: -5963.07648733 hartree
twoeener: 2523.71852831 hartree
cpcmener: -0.02476479 hartree
kineticenergy: 1395.23300824 hartree
xcener: -114.417508586490 hartree
chargesum: -0.0000000
charge: -0.078021 -0.511558 -0.177329 0.144717 -0.329393 0.324547 -0.092836 -0.353674 -0.325990 -0.325702 -0.166081 -0.148027 0.003219 -0.239496 -0.197327 0.017880 0.056362 0.089545 0.283320 -0.062305 -0.141036 -0.167033 -0.253113 0.099328 0.099646 0.100117 0.095959 0.096627 0.101773 0.101449 0.096774 0.095863 0.138454 0.143010 0.149162 0.139466 0.113961 0.111465 0.181478 0.083466 0.082215 0.119683 0.112695 0.125378 0.079088 0.090225 0.092049
qa: -0.0780 -0.5116 -0.1773 0.1447 -0.3294 0.3245 -0.0928 -0.3537 -0.3260 -0.3257 -0.1661 -0.1480 0.0032 -0.2395 -0.1973 0.0179 0.0564 0.0895 0.2833 -0.0623 -0.1410 -0.1670 -0.2531 0.0993 0.0996 0.1001 0.0960 0.0966 0.1018 0.1014 0.0968 0.0959 0.1385 0.1430 0.1492 0.1395 0.1140 0.1115 0.1815 0.0835 0.0822 0.1197 0.1127 0.1254 0.0791 0.0902 0.0920
va: 1.2453 1.9880 3.2299 3.3761 2.9525 3.6393 3.7247 3.9254 3.9192 3.9170 4.0097 3.9042 3.6940 3.9880 4.0328 3.8288 3.8336 3.8810 4.2163 3.9813 3.9079 3.8805 3.9131 1.0075 1.0012 1.0009 1.0036 1.0039 1.0039 1.0037 1.0040 1.0037 1.0049 0.9992 1.0045 1.0041 1.0015 1.0197 1.0194 1.0047 1.0192 0.9950 1.0113 0.9909 1.0082 1.0034 1.0064
dispcorr: -0.022365338 hartree
energy: -1400.206869911801
dipole: 27.54289 -26.96637 0.57651 -8.76780 8.69569 -0.07212 -6.55103 7.78428 1.23325
magnitude: 1.36326 au
magnitude: 3.46512 debye
