program: Orca
programVersion: 5.0.2
elementType: Cl O N N N C C C C C C C C C C C C C C C C C C H H H H H H H H H H H H H H H H H H H H H H H H
charge: 0
multiplicity: 1
keywords: wb97x-d3
keywords: def2-TZVPP
keywords: def2/J RIJCOSX
keywords: DEFGRID2
keywords: scfconv7
keywords: smallprint printgap noloewdin
keywords: NOSOSCF
formula: C18H24ClN3O
InChI: InChI=1/C18H24ClN3O/c1-6-14-15(19)16(22(5)21-14)17(23)20-11-12-7-9-13(10-8-12)18(2,3)4/h7-10,20H,6,11H2,1-5H3
47 atoms
Cl -3.584141 -0.29093 -2.369353
O  -0.682707 1.706991 0.510479
N  -0.570449 0.548775 -1.419795
N  -2.688593 -0.206158 1.372706
N  -3.844826 -0.845743 1.450591
C  5.423958 -0.226473 1.18903
C  4.17809 0.177539 0.406636
C  6.34213 -1.048089 0.275657
C  5.018929 -1.078532 2.397909
C  6.207685 0.983227 1.696178
C  3.324246 -0.807279 -0.101471
C  3.837526 1.502197 0.152363
C  1.858776 0.846879 -1.074267
C  2.191559 -0.48326 -0.827549
C  2.695034 1.830423 -0.570642
C  0.634696 1.206857 -1.878747
C  -2.354861 0.095295 0.0995
C  -4.30777 -0.968269 0.218768
C  -1.12934 0.853015 -0.242682
C  -3.394065 -0.390909 -0.671753
C  -5.621385 -1.601137 -0.085102
C  -1.948117 0.057201 2.589851
C  -6.725057 -0.573653 -0.321061
H  5.859558 -1.961659 -0.075437
H  6.645656 -0.474562 -0.6025
H  7.248849 -1.342431 0.809388
H  5.903563 -1.379604 2.963856
H  4.365247 -0.525009 3.075026
H  4.496886 -1.990486 2.104309
H  6.56464 1.616497 0.881577
H  5.617066 1.604469 2.372552
H  7.085823 0.646774 2.250472
H  3.545524 -1.854746 0.065754
H  4.454442 2.310013 0.52225
H  1.560814 -1.280589 -1.204371
H  2.457784 2.874866 -0.738543
H  0.489465 2.288717 -1.872561
H  0.76903 0.916107 -2.921082
H  -0.911077 -0.235888 -1.951265
H  -5.522196 -2.240751 -0.964923
H  -5.8968 -2.253207 0.745339
H  -2.408013 -0.529611 3.379968
H  -0.908759 -0.246701 2.486847
H  -1.991031 1.110829 2.858174
H  -7.670646 -1.069923 -0.542498
H  -6.491492 0.081566 -1.161045
H  -6.875487 0.052074 0.559295
elementType: Cl O N C H
totalener: -1400.18455019 hartree
nucrepener: 2027.83226865 hartree
electener: -3428.01681884 hartree
oneelecener: -5940.62741116 hartree
twoeener: 2512.61059232 hartree
cpcmener: -0.02782020 hartree
kineticenergy: 1395.23349894 hartree
xcener: -114.416455916264 hartree
chargesum: -0.0000000
charge: -0.076127 -0.502871 -0.194467 0.137026 -0.329880 0.323959 -0.103165 -0.325309 -0.327188 -0.355780 -0.176666 -0.162444 0.021588 -0.239371 -0.175064 0.007558 0.073368 0.085808 0.282365 -0.054735 -0.139538 -0.166760 -0.252415 0.095855 0.102121 0.096152 0.096242 0.102279 0.096583 0.099530 0.101553 0.099947 0.139735 0.143915 0.133991 0.135749 0.115533 0.122114 0.185144 0.080776 0.082491 0.112421 0.126167 0.120148 0.091803 0.079835 0.090022
qa: -0.0761 -0.5029 -0.1945 0.1370 -0.3299 0.3240 -0.1032 -0.3253 -0.3272 -0.3558 -0.1767 -0.1624 0.0216 -0.2394 -0.1751 0.0076 0.0734 0.0858 0.2824 -0.0547 -0.1395 -0.1668 -0.2524 0.0959 0.1021 0.0962 0.0962 0.1023 0.0966 0.0995 0.1016 0.0999 0.1397 0.1439 0.1340 0.1357 0.1155 0.1221 0.1851 0.0808 0.0825 0.1124 0.1262 0.1201 0.0918 0.0798 0.0900
va: 1.2472 2.0135 3.2157 3.3806 2.9479 3.6420 3.7401 3.9180 3.9159 3.9267 3.9843 3.9068 3.5779 4.0174 4.0093 3.8361 3.7716 3.8987 4.1978 3.9675 3.9102 3.8779 3.9141 1.0042 1.0037 1.0038 1.0037 1.0036 1.0046 1.0008 1.0010 1.0071 1.0025 0.9983 1.0098 1.0072 1.0062 0.9965 1.0133 1.0062 1.0185 1.0109 0.9907 0.9950 1.0066 1.0069 1.0039
dispcorr: -0.022244776 hartree
energy: -1400.206794967077
dipole: 32.27908 -31.53389 0.74519 -3.89958 2.90878 -0.99080 15.68149 -16.52279 -0.84129
magnitude: 1.49826 au
magnitude: 3.80826 debye
