program: Orca
programVersion: 5.0.2
elementType: Cl O N N N C C C C C C C C C C C C C C C C C C H H H H H H H H H H H H H H H H H H H H H H H H
charge: 0
multiplicity: 1
keywords: wb97x-d3
keywords: def2-TZVPP
keywords: def2/J RIJCOSX
keywords: DEFGRID2
keywords: scfconv7
keywords: smallprint printgap noloewdin
keywords: NOSOSCF
formula: C18H24ClN3O
InChI: InChI=1/C18H24ClN3O/c1-6-14-15(19)16(22(5)21-14)17(23)20-11-12-7-9-13(10-8-12)18(2,3)4/h7-10,20H,6,11H2,1-5H3
47 atoms
Cl -1.59329 -1.566112 1.090801
O  -1.421679 2.532962 -1.045478
N  -0.685301 1.524411 0.844057
N  -3.754771 0.878116 -0.955658
N  -4.571479 -0.160547 -0.934552
C  5.153926 -1.010461 -0.441874
C  3.974519 -0.132262 -0.039166
C  6.016433 -1.407975 0.756148
C  6.035215 -0.246577 -1.438198
C  4.629184 -2.293248 -1.099405
C  3.062981 0.295155 -1.009321
C  3.747246 0.278631 1.267843
C  1.75117 1.480656 0.628345
C  1.974976 1.082313 -0.687913
C  2.652871 1.071415 1.595553
C  0.533497 2.293191 0.982979
C  -2.604311 0.647763 -0.280723
C  -3.970237 -1.113772 -0.247345
C  -1.517966 1.654244 -0.208998
C  -2.725668 -0.647404 0.190573
C  -4.60299 -2.438976 0.002618
C  -4.172763 2.068445 -1.666254
C  -5.152357 -2.570548 1.421572
H  6.45467 -0.540664 1.252861
H  5.450555 -1.975333 1.497053
H  6.840823 -2.040642 0.424023
H  6.425245 0.670771 -0.994926
H  6.885398 -0.858493 -1.746826
H  5.488036 0.030827 -2.339722
H  5.458382 -2.944209 -1.383901
H  3.984548 -2.84919 -0.417326
H  4.053279 -2.08696 -2.001916
H  3.202209 0.007739 -2.044398
H  4.42049 -0.016747 2.060454
H  1.290281 1.395274 -1.467338
H  2.506977 1.368879 2.628012
H  0.606164 2.652195 2.012003
H  0.448161 3.170959 0.344344
H  -0.787243 0.726904 1.449614
H  -5.40629 -2.577112 -0.721971
H  -3.872613 -3.23016 -0.182701
H  -3.579827 2.218159 -2.564465
H  -5.214418 1.918074 -1.931822
H  -4.080631 2.951043 -1.038952
H  -5.90608 -1.809117 1.61972
H  -4.36308 -2.462487 2.165199
H  -5.614453 -3.546794 1.568472
totalener: -1400.16265217 hartree
nucrepener: 2043.04172223 hartree
electener: -3443.20437440 hartree
oneelecener: -5970.34829778 hartree
twoeener: 2527.14392337 hartree
kineticenergy: 1395.29035130 hartree
xcener: -114.423649930016 hartree
chargesum: -0.0000000
charge: -0.077458 -0.422704 -0.192360 0.138344 -0.289012 0.253528 -0.052809 -0.335916 -0.288310 -0.290155 -0.162464 -0.128472 -0.017721 -0.159927 -0.140953 -0.033984 -0.003369 0.086747 0.283991 -0.034252 -0.150514 -0.165174 -0.242969 0.093128 0.096496 0.090994 0.098495 0.087133 0.087815 0.086663 0.099556 0.087907 0.106847 0.117209 0.132358 0.105498 0.098471 0.123556 0.156331 0.085411 0.078067 0.119160 0.113090 0.112676 0.089779 0.076223 0.083049
qa: -0.0775 -0.4227 -0.1924 0.1383 -0.2890 0.2535 -0.0528 -0.3359 -0.2883 -0.2902 -0.1625 -0.1285 -0.0177 -0.1599 -0.1410 -0.0340 -0.0034 0.0867 0.2840 -0.0343 -0.1505 -0.1652 -0.2430 0.0931 0.0965 0.0910 0.0985 0.0871 0.0878 0.0867 0.0996 0.0879 0.1068 0.1172 0.1324 0.1055 0.0985 0.1236 0.1563 0.0854 0.0781 0.1192 0.1131 0.1127 0.0898 0.0762 0.0830
va: 1.2500 2.0797 3.1956 3.3730 2.9419 3.7577 3.7428 3.9303 3.9240 3.9225 4.0617 3.9735 3.7248 4.0345 4.0570 3.8525 3.8444 3.8880 4.2160 3.9493 3.9071 3.8920 3.9145 1.0028 1.0026 1.0122 1.0066 1.0063 1.0080 1.0065 1.0060 1.0081 1.0128 1.0059 1.0178 1.0126 1.0026 1.0244 1.0566 1.0201 1.0062 0.9965 1.0102 0.9949 1.0044 1.0100 1.0085
dispcorr: -0.022215364 hartree
energy: -1400.184867532812
dipole: 25.42113 -24.96891 0.45222 -6.72568 6.42591 -0.29977 -3.32592 3.93567 0.60975
magnitude: 0.81619 au
magnitude: 2.07458 debye
