program: Orca
programVersion: 5.0.2
elementType: Cl O N N N C C C C C C C C C C C C C C C C C C H H H H H H H H H H H H H H H H H H H H H H H H
charge: 0
multiplicity: 1
keywords: wb97x-d3
keywords: def2-TZVPP
keywords: def2/J RIJCOSX
keywords: DEFGRID2
keywords: scfconv7
keywords: smallprint printgap noloewdin
keywords: NOSOSCF
formula: C18H24ClN3O
InChI: InChI=1/C18H24ClN3O/c1-6-14-15(19)16(22(5)21-14)17(23)20-11-12-7-9-13(10-8-12)18(2,3)4/h7-10,20H,6,11H2,1-5H3
47 atoms
Cl -2.059192 -1.82005 -1.100077
O  -1.437527 2.641425 0.282473
N  -0.619546 1.042595 -1.087922
N  -3.663516 1.036169 0.934622
N  -4.554809 0.085146 1.144713
C  5.440721 -0.659817 0.707568
C  4.167124 -0.018046 0.168135
C  5.437204 -0.763385 2.232657
C  6.650368 0.184944 0.28581
C  5.579228 -2.076547 0.134773
C  3.988359 0.121182 -1.206841
C  3.145688 0.451477 0.990986
C  1.827062 1.151093 -0.906116
C  2.841162 0.69016 -1.734932
C  1.998531 1.026215 0.466218
C  0.572835 1.763593 -1.473987
C  -2.641324 0.62665 0.141817
C  -4.143262 -0.987272 0.494975
C  -1.516471 1.529182 -0.206564
C  -2.941241 -0.693829 -0.154364
C  -4.918542 -2.259096 0.48232
C  -3.895259 2.325993 1.553684
C  -5.713728 -2.449864 -0.807497
H  6.36007 -1.236299 2.571679
H  5.381831 0.215523 2.712056
H  4.608037 -1.369864 2.601199
H  7.575862 -0.25709 0.660908
H  6.740052 0.260111 -0.798432
H  6.578595 1.19909 0.681119
H  5.640643 -2.076675 -0.953791
H  6.485523 -2.554051 0.512691
H  4.729148 -2.699415 0.4165
H  4.754118 -0.224666 -1.890518
H  3.232289 0.375861 2.066035
H  2.736828 0.773438 -2.81083
H  1.230043 1.387817 1.139346
H  0.460827 2.793462 -1.137995
H  0.633717 1.790624 -2.564868
H  -0.700982 0.091363 -1.405675
H  -4.237255 -3.101676 0.621693
H  -5.594086 -2.256289 1.338494
H  -3.106416 2.573116 2.258112
H  -3.9542 3.115278 0.809758
H  -4.843044 2.242689 2.075974
H  -6.427553 -1.638587 -0.947962
H  -6.270712 -3.38652 -0.783875
H  -5.059937 -2.474755 -1.679013
totalener: -1400.16309768 hartree
nucrepener: 2021.65278320 hartree
electener: -3421.81588088 hartree
oneelecener: -5927.50399465 hartree
twoeener: 2505.68811377 hartree
kineticenergy: 1395.28457365 hartree
xcener: -114.424401506547 hartree
chargesum: -0.0000000
charge: -0.080377 -0.430364 -0.207860 0.142657 -0.289217 0.253026 -0.053304 -0.336264 -0.287743 -0.289702 -0.140858 -0.143458 -0.026371 -0.177505 -0.128434 -0.016423 -0.049179 0.079784 0.321710 -0.007818 -0.148896 -0.159627 -0.242489 0.090776 0.093735 0.097117 0.086948 0.086309 0.099510 0.086013 0.087145 0.099401 0.105360 0.117787 0.107324 0.128637 0.122653 0.095153 0.161690 0.076431 0.085459 0.114564 0.114285 0.112331 0.090461 0.082907 0.076716
qa: -0.0804 -0.4304 -0.2079 0.1427 -0.2892 0.2530 -0.0533 -0.3363 -0.2877 -0.2897 -0.1409 -0.1435 -0.0264 -0.1775 -0.1284 -0.0164 -0.0492 0.0798 0.3217 -0.0078 -0.1489 -0.1596 -0.2425 0.0908 0.0937 0.0971 0.0869 0.0863 0.0995 0.0860 0.0871 0.0994 0.1054 0.1178 0.1073 0.1286 0.1227 0.0952 0.1617 0.0764 0.0855 0.1146 0.1143 0.1123 0.0905 0.0829 0.0767
va: 1.2484 2.0770 3.1932 3.3703 2.9422 3.7600 3.7399 3.9325 3.9214 3.9212 4.0657 3.9636 3.7709 4.0844 4.0191 3.8346 3.8730 3.9085 4.2061 3.9139 3.9045 3.8874 3.9160 1.0116 1.0028 1.0025 1.0064 1.0080 1.0067 1.0084 1.0066 1.0063 1.0120 1.0075 1.0118 1.0158 1.0238 1.0014 1.0607 1.0070 1.0198 0.9982 0.9970 1.0105 1.0047 1.0083 1.0084
dispcorr: -0.021734411 hartree
energy: -1400.184832089604
dipole: 28.10232 -27.58375 0.51857 -3.63339 3.12681 -0.50658 6.70411 -7.05177 -0.34766
magnitude: 0.80400 au
magnitude: 2.04360 debye
