program: Orca
programVersion: 5.0.2
elementType: Cl O N N N C C C C C C C C C C C C C C C C C C H H H H H H H H H H H H H H H H H H H H H H H H
charge: 0
multiplicity: 1
keywords: wb97x-d3
keywords: def2-TZVPP
keywords: def2/J RIJCOSX
keywords: DEFGRID2
keywords: scfconv7
keywords: smallprint printgap noloewdin
keywords: NOSOSCF
formula: C18H24ClN3O
InChI: InChI=1/C18H24ClN3O/c1-6-14-15(19)16(22(5)21-14)17(23)20-11-12-7-9-13(10-8-12)18(2,3)4/h7-10,20H,6,11H2,1-5H3
47 atoms
Cl -1.361581 -1.408623 1.228504
O  -1.691613 2.555148 -1.155522
N  -0.614061 1.663599 0.624994
N  -3.889545 0.794667 -0.66571
N  -4.632903 -0.283487 -0.486977
C  5.166825 -1.113063 -0.352586
C  3.983899 -0.168446 -0.167067
C  5.084998 -1.895909 -1.663551
C  5.192112 -2.121272 0.80357
C  6.470902 -0.304831 -0.354661
C  3.890053 0.61055 0.984721
C  2.959129 -0.043557 -1.102483
C  1.794491 1.567661 0.267222
C  2.81639 1.459102 1.200711
C  1.884421 0.805506 -0.89026
C  0.59654 2.447487 0.513686
C  -2.651797 0.665884 -0.131595
C  -3.896778 -1.159674 0.168468
C  -1.61573 1.717362 -0.276471
C  -2.638047 -0.602528 0.420313
C  -4.389667 -2.515872 0.545745
C  -4.464336 1.919235 -1.373024
C  -5.774289 -2.834637 0.00312
H  5.94441 -2.562429 -1.749257
H  4.188368 -2.515802 -1.716153
H  5.09667 -1.240255 -2.535763
H  6.028287 -2.814285 0.690004
H  5.303033 -1.632617 1.771997
H  4.272599 -2.707468 0.833982
H  6.483461 0.418503 -1.170998
H  6.613325 0.245579 0.575776
H  7.331047 -0.96596 -0.478111
H  4.663286 0.553711 1.741153
H  2.982633 -0.617301 -2.01851
H  2.774016 2.041421 2.114159
H  1.104845 0.872228 -1.640397
H  0.740442 3.030179 1.427275
H  0.457189 3.160416 -0.297934
H  -0.604367 0.917135 1.300083
H  -3.67077 -3.260855 0.193489
H  -4.386661 -2.604667 1.636084
H  -5.516364 1.690658 -1.510572
H  -4.363432 2.835857 -0.797853
H  -3.987415 2.062159 -2.338643
H  -6.07272 -3.839754 0.298582
H  -5.796616 -2.782112 -1.084538
H  -6.520606 -2.136493 0.378691
totalener: -1400.16209926 hartree
nucrepener: 2036.56505674 hartree
electener: -3436.72715600 hartree
oneelecener: -5957.41334263 hartree
twoeener: 2520.68618663 hartree
kineticenergy: 1395.28907898 hartree
xcener: -114.425580283130 hartree
chargesum: 0.0000000
charge: -0.075924 -0.419453 -0.198078 0.133272 -0.309164 0.250883 -0.049521 -0.336257 -0.287997 -0.286464 -0.145933 -0.132668 -0.031726 -0.165941 -0.140636 -0.016590 -0.005677 0.074161 0.289618 -0.045823 -0.106622 -0.166423 -0.234354 0.090609 0.096433 0.095602 0.086478 0.085640 0.099507 0.099256 0.086333 0.087330 0.104843 0.119165 0.107875 0.125023 0.093834 0.123248 0.157525 0.074516 0.078126 0.112210 0.112956 0.119293 0.082967 0.084608 0.083943
qa: -0.0759 -0.4195 -0.1981 0.1333 -0.3092 0.2509 -0.0495 -0.3363 -0.2880 -0.2865 -0.1459 -0.1327 -0.0317 -0.1659 -0.1406 -0.0166 -0.0057 0.0742 0.2896 -0.0458 -0.1066 -0.1664 -0.2344 0.0906 0.0964 0.0956 0.0865 0.0856 0.0995 0.0993 0.0863 0.0873 0.1048 0.1192 0.1079 0.1250 0.0938 0.1232 0.1575 0.0745 0.0781 0.1122 0.1130 0.1193 0.0830 0.0846 0.0839
va: 1.2558 2.0870 3.1930 3.3639 2.8803 3.7627 3.7312 3.9311 3.9219 3.9210 4.0687 3.9471 3.7560 4.0720 4.0151 3.8398 3.8348 3.8831 4.2277 3.9949 3.9310 3.8902 3.9466 1.0117 1.0025 1.0024 1.0072 1.0083 1.0064 1.0066 1.0081 1.0066 1.0120 1.0065 1.0115 1.0131 1.0026 1.0261 1.0559 1.0020 0.9996 1.0107 0.9950 0.9971 1.0040 1.0079 1.0076
dispcorr: -0.021964177 hartree
energy: -1400.184063441962
dipole: 23.83516 -23.26358 0.57158 -8.58408 8.28004 -0.30404 -5.54694 6.12170 0.57476
magnitude: 0.86573 au
magnitude: 2.20051 debye
