program: Orca
programVersion: 5.0.2
elementType: Cl O N N N C C C C C C C C C C C C C C C C C C H H H H H H H H H H H H H H H H H H H H H H H H
charge: 0
multiplicity: 1
keywords: wb97x-d3
keywords: def2-TZVPP
keywords: def2/J RIJCOSX
keywords: DEFGRID2
keywords: scfconv7
keywords: smallprint printgap noloewdin
keywords: NOSOSCF
formula: C18H24ClN3O
InChI: InChI=1/C18H24ClN3O/c1-6-14-15(19)16(22(5)21-14)17(23)20-11-12-7-9-13(10-8-12)18(2,3)4/h7-10,20H,6,11H2,1-5H3
47 atoms
Cl -1.453757 -1.757347 -0.279082
O  -1.847058 2.856795 0.254555
N  -0.566345 1.293369 -0.759158
N  -4.049053 1.044274 0.233566
N  -4.837403 -0.009086 0.356636
C  5.428415 -0.90691 0.503793
C  4.187585 -0.118366 0.101503
C  6.446861 -1.004924 -0.631717
C  5.022134 -2.331105 0.904612
C  6.102892 -0.212702 1.694168
C  4.03386 0.468876 -1.147653
C  3.140087 0.041511 1.013339
C  1.857006 1.339474 -0.562052
C  2.887109 1.184693 -1.47388
C  1.999082 0.750139 0.692122
C  0.613928 2.114278 -0.907882
C  -2.761167 0.702553 -0.011626
C  -4.084643 -1.08052 0.200617
C  -1.692455 1.721185 -0.154101
C  -2.764964 -0.68128 -0.038255
C  -4.622569 -2.469659 0.276679
C  -4.637967 2.360125 0.37014
C  -6.119146 -2.531279 0.540516
H  7.313402 -1.579401 -0.301379
H  6.036529 -1.51096 -1.507329
H  6.810153 -0.024304 -0.943773
H  4.333782 -2.341822 1.750112
H  4.535848 -2.849061 0.076869
H  5.900807 -2.911341 1.193201
H  6.411606 0.800675 1.434057
H  5.440879 -0.143726 2.557854
H  6.991499 -0.765195 2.006142
H  4.808276 0.375575 -1.896282
H  3.212589 -0.396444 2.001323
H  2.801623 1.626136 -2.460252
H  1.207136 0.848133 1.425206
H  0.501204 2.980486 -0.255833
H  0.686053 2.499598 -1.929775
H  -0.513166 0.350077 -1.106371
H  -4.387069 -2.990941 -0.655726
H  -4.083649 -3.015124 1.056789
H  -4.391676 2.990355 -0.479768
H  -5.712077 2.210906 0.413998
H  -4.295743 2.852007 1.276461
H  -6.451997 -3.567846 0.577011
H  -6.683572 -2.022693 -0.239589
H  -6.375616 -2.060717 1.488389
totalener: -1400.16289427 hartree
nucrepener: 2018.99887940 hartree
electener: -3419.16177367 hartree
oneelecener: -5922.21400352 hartree
twoeener: 2503.05222985 hartree
kineticenergy: 1395.28370100 hartree
xcener: -114.425328744413 hartree
chargesum: -0.0000000
charge: -0.075560 -0.419335 -0.213979 0.130917 -0.307615 0.253609 -0.051053 -0.336785 -0.289555 -0.288503 -0.138481 -0.132880 -0.041107 -0.110752 -0.203355 0.006142 -0.011870 0.072498 0.306679 -0.043030 -0.108108 -0.163427 -0.234186 0.091201 0.096238 0.094222 0.087665 0.098648 0.087250 0.099082 0.088027 0.087294 0.117889 0.108063 0.106900 0.118683 0.121186 0.088892 0.160290 0.076266 0.077066 0.112452 0.112140 0.118322 0.083357 0.083906 0.084696
qa: -0.0756 -0.4193 -0.2140 0.1309 -0.3076 0.2536 -0.0511 -0.3368 -0.2896 -0.2885 -0.1385 -0.1329 -0.0411 -0.1108 -0.2034 0.0061 -0.0119 0.0725 0.3067 -0.0430 -0.1081 -0.1634 -0.2342 0.0912 0.0962 0.0942 0.0877 0.0986 0.0872 0.0991 0.0880 0.0873 0.1179 0.1081 0.1069 0.1187 0.1212 0.0889 0.1603 0.0763 0.0771 0.1125 0.1121 0.1183 0.0834 0.0839 0.0847
va: 1.2565 2.0939 3.1853 3.3672 2.8780 3.7579 3.7380 3.9307 3.9218 3.9232 3.9823 4.0286 3.7580 4.0368 4.0660 3.8204 3.8396 3.8864 4.2087 3.9905 3.9301 3.8898 3.9469 1.0120 1.0026 1.0026 1.0081 1.0062 1.0066 1.0065 1.0076 1.0064 1.0063 1.0115 1.0132 1.0127 1.0208 1.0031 1.0522 1.0007 1.0005 0.9963 1.0104 0.9966 1.0038 1.0079 1.0075
dispcorr: -0.021649034 hartree
energy: -1400.184543304207
dipole: 25.02574 -24.34990 0.67584 -5.66238 5.16340 -0.49898 4.64363 -5.03141 -0.38778
magnitude: 0.92526 au
magnitude: 2.35183 debye
