program: Orca
programVersion: 5.0.2
elementType: O O O O O O C C C C C C C C C C C C C C C C C C C C C C C H H H H H H H H H H H H H H H H H H H H H H
charge: 0
multiplicity: 1
keywords: wb97x-d3
keywords: def2-TZVPP
keywords: def2/J RIJCOSX
keywords: DEFGRID2
keywords: scfconv7
keywords: smallprint printgap noloewdin
keywords: NOSOSCF
formula: C23H22O6
InChI: InChI=1/C23H22O6/c1-11(2)16-8-14-15(28-16)6-5-12-22(24)21-13-7-18(25-3)19(26-4)9-17(13)27-10-20(21)29-23(12)14/h5-7,9,16,20-21H,1,8,10H2,2-4H3
51 atoms
O  0.785555 0.829363 -1.247788
O  -1.565194 2.240455 -1.472727
O  4.010204 -0.600697 1.692244
O  -0.701484 -2.91613 -1.834764
O  -4.430496 -1.336019 1.549378
O  -4.71041 1.200841 1.927802
C  -1.057917 -0.562859 -2.026112
C  -0.078986 0.554655 -2.348308
C  1.330487 -0.210824 -0.602604
C  -2.040806 -0.080805 -0.979091
C  -0.309247 -1.79435 -1.561054
C  -0.839329 1.827508 -2.616391
C  2.395911 0.046256 0.235519
C  0.867189 -1.531363 -0.745788
C  3.087838 1.321661 0.58867
C  4.234874 0.823623 1.501181
C  2.994196 -0.998014 0.915722
C  -2.225091 1.276729 -0.775249
C  1.514401 -2.562473 -0.049788
C  -2.78917 -0.974156 -0.201385
C  2.580129 -2.322433 0.789999
C  5.602822 1.025632 0.91521
C  -3.116361 1.740669 0.194726
C  -3.676007 -0.535261 0.75873
C  -3.835469 0.849936 0.965667
C  5.912055 0.317882 -0.367508
C  6.46435 1.836345 1.522613
C  -4.281209 -2.734776 1.404596
C  -4.866684 2.577883 2.218089
H  -1.583821 -0.819422 -2.950347
H  0.522078 0.293453 -3.225428
H  -0.165588 2.646509 -2.867265
H  -1.509114 1.666699 -3.467145
H  3.465145 1.854647 -0.285945
H  2.433655 2.009576 1.125932
H  4.181465 1.286709 2.486781
H  1.152573 -3.575801 -0.164862
H  -2.666391 -2.03639 -0.364691
H  3.067595 -3.123004 1.32854
H  -3.224064 2.809548 0.325967
H  5.880224 -0.76682 -0.245652
H  5.19481 0.569237 -1.152546
H  6.904891 0.580226 -0.729863
H  7.441958 2.041807 1.104182
H  6.219014 2.329855 2.455258
H  -4.95792 -3.193668 2.122083
H  -3.261383 -3.062108 1.625286
H  -4.552631 -3.074368 0.401429
H  -3.927738 3.034643 2.540371
H  -5.583817 2.640916 3.0328
H  -5.257467 3.133808 1.362749
elementType: O C H
totalener: -1341.13523586 hartree
nucrepener: 2807.61941706 hartree
electener: -4148.75465292 hartree
oneelecener: -7411.16927438 hartree
twoeener: 3262.41462146 hartree
cpcmener: -0.04692749 hartree
kineticenergy: 1335.43409021 hartree
xcener: -127.804463418462 hartree
chargesum: 0.0000000
charge: -0.338939 -0.345221 -0.337114 -0.472988 -0.350984 -0.339809 0.193154 0.154569 0.200177 -0.225271 0.278443 0.023906 -0.101189 -0.138295 -0.155180 0.322276 0.237889 0.126798 -0.121273 -0.214345 -0.270186 -0.192002 -0.206809 0.218559 0.234793 -0.219276 -0.240200 -0.129007 -0.126825 0.090532 0.119971 0.111008 0.101013 0.108846 0.108065 0.112562 0.138997 0.134102 0.148972 0.122380 0.102301 0.101241 0.100807 0.116946 0.115063 0.124177 0.112355 0.111563 0.115010 0.124361 0.114079
qa: -0.3389 -0.3452 -0.3371 -0.4730 -0.3510 -0.3398 0.1932 0.1546 0.2002 -0.2253 0.2784 0.0239 -0.1012 -0.1383 -0.1552 0.3223 0.2379 0.1268 -0.1213 -0.2143 -0.2702 -0.1920 -0.2068 0.2186 0.2348 -0.2193 -0.2402 -0.1290 -0.1268 0.0905 0.1200 0.1110 0.1010 0.1088 0.1081 0.1126 0.1390 0.1341 0.1490 0.1224 0.1023 0.1012 0.1008 0.1169 0.1151 0.1242 0.1124 0.1116 0.1150 0.1244 0.1141
va: 2.1414 2.0628 2.1132 2.0054 2.0314 2.0459 3.6441 3.8276 4.0459 3.8573 4.0198 3.9206 3.6096 3.5067 3.9952 3.7010 3.8590 4.0082 3.9699 3.8597 4.0836 3.8128 3.9316 3.9412 3.9590 3.9198 3.9302 3.8753 3.8673 1.0286 1.0071 0.9902 1.0008 1.0027 1.0096 1.0050 1.0213 1.0355 1.0064 1.0330 1.0001 0.9950 1.0059 1.0090 1.0125 0.9931 0.9875 0.9865 0.9878 0.9934 0.9863
dispcorr: -0.026007337 hartree
energy: -1341.161243194084
dipole: 9.14654 -8.00652 1.14002 6.96363 -5.05703 1.90660 3.60434 -4.30518 -0.70084
magnitude: 2.32937 au
magnitude: 5.92078 debye
