program: Orca
programVersion: 5.0.2
elementType: O O O O O O C C C C C C C C C C C C C C C C C C C C C C C H H H H H H H H H H H H H H H H H H H H H H
charge: 0
multiplicity: 1
keywords: wb97x-d3
keywords: def2-TZVPP
keywords: def2/J RIJCOSX
keywords: DEFGRID2
keywords: scfconv7
keywords: smallprint printgap noloewdin
keywords: NOSOSCF
formula: C23H22O6
InChI: InChI=1/C23H22O6/c1-11(2)16-8-14-15(28-16)6-5-12-22(24)21-13-7-18(25-3)19(26-4)9-17(13)27-10-20(21)29-23(12)14/h5-7,9,16,20-21H,1,8,10H2,2-4H3
51 atoms
O  0.774479 0.883297 -1.234112
O  -1.581677 2.303028 -1.392401
O  3.959268 -0.689407 1.678183
O  -0.701047 -2.830306 -2.017716
O  -4.354224 -1.422257 1.537737
O  -4.644832 1.093198 2.029189
C  -1.06816 -0.470869 -2.075952
C  -0.090607 0.661401 -2.346425
C  1.316872 -0.186943 -0.636859
C  -2.035814 -0.04141 -0.99218
C  -0.314534 -1.723887 -1.682583
C  -0.856348 1.943928 -2.55426
C  2.372577 0.027008 0.226791
C  0.85931 -1.499753 -0.851454
C  3.052615 1.284538 0.660051
C  4.191579 0.72785 1.556251
C  2.962569 -1.050595 0.859744
C  -2.223158 1.304949 -0.725946
C  1.502156 -2.565253 -0.205069
C  -2.760516 -0.972998 -0.237339
C  2.557948 -2.368079 0.65807
C  5.55937 1.002473 0.994564
C  -3.096781 1.720046 0.28178
C  -3.626446 -0.582211 0.761886
C  -3.791093 0.791408 1.030941
C  5.973875 2.438896 1.089345
C  6.334713 0.06188 0.464171
C  -4.202397 -2.81212 1.325596
C  -4.828533 2.457564 2.36046
H  -1.605095 -0.677241 -3.006358
H  0.50974 0.44427 -3.235828
H  -0.186397 2.775411 -2.770524
H  -1.527043 1.817306 -3.409625
H  3.441204 1.86018 -0.181038
H  2.38567 1.939789 1.221351
H  4.130124 1.147832 2.563724
H  1.142939 -3.57111 -0.37887
H  -2.635176 -2.026042 -0.450577
H  3.043011 -3.193896 1.159771
H  -3.207889 2.781687 0.460818
H  5.970934 2.776739 2.12837
H  6.972977 2.592728 0.684992
H  5.287742 3.092787 0.546369
H  7.309897 0.313389 0.06697
H  6.04553 -0.978334 0.404367
H  -4.84837 -3.3071 2.046995
H  -3.173612 -3.142124 1.49282
H  -4.51001 -3.109247 0.319503
H  -3.895847 2.927601 2.682186
H  -5.534759 2.481209 3.187096
H  -5.24512 3.027715 1.52648
elementType: O C H
totalener: -1341.13493226 hartree
nucrepener: 2805.90622463 hartree
electener: -4147.04115689 hartree
oneelecener: -7407.79763354 hartree
twoeener: 3260.75647665 hartree
cpcmener: -0.04752992 hartree
kineticenergy: 1335.41755173 hartree
xcener: -127.803338429078 hartree
chargesum: 0.0000000
charge: -0.338623 -0.344704 -0.329612 -0.471408 -0.351150 -0.339923 0.196181 0.153505 0.219521 -0.226705 0.274028 0.023494 -0.113092 -0.141238 -0.120026 0.268987 0.242180 0.126736 -0.112603 -0.214560 -0.274514 -0.125125 -0.206186 0.219523 0.235128 -0.237801 -0.281934 -0.128862 -0.127072 0.089594 0.119820 0.111326 0.101140 0.100860 0.105393 0.115700 0.139178 0.134707 0.148841 0.122509 0.102516 0.095884 0.100032 0.118914 0.118144 0.124233 0.111947 0.111611 0.114969 0.124360 0.114176
qa: -0.3386 -0.3447 -0.3296 -0.4714 -0.3512 -0.3399 0.1962 0.1535 0.2195 -0.2267 0.2740 0.0235 -0.1131 -0.1412 -0.1200 0.2690 0.2422 0.1267 -0.1126 -0.2146 -0.2745 -0.1251 -0.2062 0.2195 0.2351 -0.2378 -0.2819 -0.1289 -0.1271 0.0896 0.1198 0.1113 0.1011 0.1009 0.1054 0.1157 0.1392 0.1347 0.1488 0.1225 0.1025 0.0959 0.1000 0.1189 0.1181 0.1242 0.1119 0.1116 0.1150 0.1244 0.1142
va: 2.1430 2.0636 2.1211 2.0067 2.0314 2.0456 3.6388 3.8277 4.0078 3.8553 4.0230 3.9190 3.6645 3.5132 3.9553 3.7762 3.8667 4.0100 3.9581 3.8562 4.0823 3.7323 3.9305 3.9386 3.9588 3.9443 3.9245 3.8758 3.8676 1.0288 1.0073 0.9899 1.0004 1.0064 1.0084 1.0009 1.0214 1.0343 1.0068 1.0331 0.9973 1.0031 0.9990 1.0103 1.0163 0.9932 0.9875 0.9868 0.9873 0.9934 0.9867
dispcorr: -0.025706266 hartree
energy: -1341.160638523339
dipole: 9.22942 -8.18793 1.04149 9.28249 -7.04633 2.23616 5.77654 -6.13852 -0.36198
magnitude: 2.49322 au
magnitude: 6.33727 debye
