program: Orca
programVersion: 5.0.2
elementType: O O O O O O C C C C C C C C C C C C C C C C C C C C C C C H H H H H H H H H H H H H H H H H H H H H H
charge: 0
multiplicity: 1
keywords: wb97x-d3
keywords: def2-TZVPP
keywords: def2/J RIJCOSX
keywords: DEFGRID2
keywords: scfconv7
keywords: smallprint printgap noloewdin
keywords: NOSOSCF
formula: C23H22O6
InChI: InChI=1/C23H22O6/c1-11(2)16-8-14-15(28-16)6-5-12-22(24)21-13-7-18(25-3)19(26-4)9-17(13)27-10-20(21)29-23(12)14/h5-7,9,16,20-21H,1,8,10H2,2-4H3
51 atoms
O  0.759591 0.849012 -1.302375
O  -1.585756 2.286917 -1.412143
O  3.975148 -0.728505 1.567444
O  -0.759049 -2.85393 -2.038705
O  -4.317236 -1.396211 1.595796
O  -4.56995 1.122079 2.084717
C  -1.112528 -0.492669 -2.09724
C  -0.131536 0.630649 -2.393389
C  1.299218 -0.219839 -0.705009
C  -2.050493 -0.048981 -0.993574
C  -0.359666 -1.750914 -1.7164
C  -0.888535 1.920375 -2.58581
C  2.365807 -0.006648 0.145506
C  0.831536 -1.530777 -0.906955
C  3.07086 1.247553 0.546519
C  4.157168 0.698903 1.512168
C  2.963681 -1.084402 0.770473
C  -2.217396 1.300139 -0.728406
C  1.480342 -2.596471 -0.267914
C  -2.765173 -0.970206 -0.216561
C  2.551187 -2.400837 0.577328
C  5.553894 1.048251 1.085052
C  -3.061505 1.726686 0.299813
C  -3.602668 -0.568892 0.802664
C  -3.746955 0.808789 1.070446
C  5.882272 2.502217 1.227591
C  6.421656 0.152179 0.625886
C  -4.183624 -2.786263 1.391723
C  -4.735974 2.484829 2.419274
H  -1.67181 -0.700853 -3.014365
H  0.447261 0.405757 -3.296051
H  -0.214052 2.745401 -2.81607
H  -1.577065 1.802766 -3.429407
H  3.50825 1.764842 -0.31025
H  2.412047 1.956754 1.049306
H  3.989904 1.079003 2.5247
H  1.113312 -3.601413 -0.432771
H  -2.654113 -2.025275 -0.428615
H  3.041716 -3.227455 1.072872
H  -3.156484 2.790388 0.476983
H  5.759274 2.832057 2.262431
H  6.907435 2.712051 0.925753
H  5.221726 3.126875 0.620559
H  7.418626 0.448986 0.324982
H  6.186925 -0.899656 0.534158
H  -4.815502 -3.270535 2.133652
H  -3.153813 -3.126787 1.535863
H  -4.520311 -3.090976 0.396226
H  -5.422196 2.51351 3.263101
H  -5.17005 3.060097 1.596762
H  -3.793443 2.950912 2.720185
elementType: O C H
totalener: -1341.14234619 hartree
nucrepener: 2805.36484031 hartree
electener: -4146.50718649 hartree
oneelecener: -7406.51906718 hartree
twoeener: 3260.01188069 hartree
cpcmener: -0.03864896 hartree
kineticenergy: 1335.44915413 hartree
xcener: -127.807283684131 hartree
chargesum: -0.0000000
charge: -0.327240 -0.331545 -0.317836 -0.438492 -0.333317 -0.322371 0.196944 0.145518 0.221195 -0.226102 0.243088 0.022512 -0.120673 -0.138473 -0.138938 0.262959 0.256904 0.123779 -0.110127 -0.218462 -0.282058 -0.117560 -0.206909 0.218764 0.232397 -0.236491 -0.271971 -0.131120 -0.129820 0.086264 0.115939 0.108196 0.097310 0.097804 0.106952 0.111457 0.138828 0.132326 0.145855 0.118213 0.102412 0.094988 0.098876 0.115066 0.116612 0.122081 0.109974 0.109318 0.122774 0.111696 0.112505
qa: -0.3272 -0.3315 -0.3178 -0.4385 -0.3333 -0.3224 0.1969 0.1455 0.2212 -0.2261 0.2431 0.0225 -0.1207 -0.1385 -0.1389 0.2630 0.2569 0.1238 -0.1101 -0.2185 -0.2821 -0.1176 -0.2069 0.2188 0.2324 -0.2365 -0.2720 -0.1311 -0.1298 0.0863 0.1159 0.1082 0.0973 0.0978 0.1070 0.1115 0.1388 0.1323 0.1459 0.1182 0.1024 0.0950 0.0989 0.1151 0.1166 0.1221 0.1100 0.1093 0.1228 0.1117 0.1125
va: 2.1546 2.0787 2.1340 2.0482 2.0521 2.0659 3.6213 3.8358 4.0080 3.8517 4.0646 3.9257 3.6637 3.5023 3.9824 3.7740 3.8741 4.0252 3.9621 3.8557 4.0848 3.7388 3.9255 3.9435 3.9649 3.9434 3.9270 3.8821 3.8744 1.0294 1.0078 0.9900 1.0003 1.0064 1.0067 1.0017 1.0215 1.0354 1.0078 1.0342 0.9975 1.0036 0.9988 1.0105 1.0179 0.9935 0.9874 0.9866 0.9939 0.9865 0.9872
dispcorr: -0.025656826 hartree
energy: -1341.168003015303
dipole: 9.21882 -8.31186 0.90696 9.62525 -7.51244 2.11281 6.50261 -6.78411 -0.28150
magnitude: 2.31641 au
magnitude: 5.88785 debye
