program: Orca
programVersion: 5.0.2
elementType: O O O O O O C C C C C C C C C C C C C C C C C C C C C C C H H H H H H H H H H H H H H H H H H H H H H
charge: 0
multiplicity: 1
keywords: wb97x-d3
keywords: def2-TZVPP
keywords: def2/J RIJCOSX
keywords: DEFGRID2
keywords: scfconv7
keywords: smallprint printgap noloewdin
keywords: NOSOSCF
formula: C23H22O6
InChI: InChI=1/C23H22O6/c1-11(2)16-8-14-15(28-16)6-5-12-22(24)21-13-7-18(25-3)19(26-4)9-17(13)27-10-20(21)29-23(12)14/h5-7,9,16,20-21H,1,8,10H2,2-4H3
51 atoms
O  0.790487 0.87374 -1.257537
O  -1.565758 2.290733 -1.44583
O  3.944976 -0.676306 1.69516
O  -0.686008 -2.843667 -2.015225
O  -4.387599 -1.407861 1.457943
O  -4.676084 1.108633 1.934012
C  -1.04658 -0.48542 -2.108265
C  -0.065339 0.645431 -2.374638
C  1.3249 -0.190217 -0.646364
C  -2.031239 -0.047575 -1.043425
C  -0.29957 -1.73609 -1.692801
C  -0.826879 1.92808 -2.594886
C  2.372923 0.030476 0.225368
C  0.867478 -1.504517 -0.852141
C  3.047086 1.290547 0.662122
C  4.202962 0.731106 1.535297
C  2.953743 -1.041744 0.875811
C  -2.217526 1.300571 -0.786352
C  1.499511 -2.564251 -0.186412
C  -2.770426 -0.973145 -0.294824
C  2.546524 -2.360116 0.685949
C  5.552536 0.962864 0.913564
C  -3.104474 1.72229 0.207239
C  -3.649455 -0.576466 0.690637
C  -3.81304 0.800315 0.951592
C  6.041346 2.372941 1.035371
C  6.247055 0.007101 0.304412
C  -4.215734 -2.797707 1.282623
C  -4.843932 2.469348 2.27741
H  -1.568332 -0.703007 -3.045181
H  0.543198 0.422783 -3.258371
H  -0.152521 2.758751 -2.804346
H  -1.486274 1.802397 -3.460241
H  3.42068 1.882829 -0.175359
H  2.378642 1.932333 1.239649
H  4.185878 1.172999 2.535089
H  1.138979 -3.571163 -0.353704
H  -2.6450 -2.027684 -0.501279
H  3.023572 -3.18142 1.202992
H  -3.213503 2.785354 0.37955
H  6.991743 2.514292 0.523026
H  5.326719 3.087418 0.618173
H  6.177512 2.647025 2.084867
H  7.208539 0.224609 -0.14434
H  5.904783 -1.016438 0.227309
H  -4.502963 -3.126289 0.27935
H  -4.868435 -3.283635 2.005163
H  -3.185922 -3.112778 1.476039
H  -5.555736 2.493711 3.099897
H  -5.24906 3.056007 1.448302
H  -3.907968 2.925476 2.611817
elementType: O C H
totalener: -1341.14235301 hartree
nucrepener: 2807.94599358 hartree
electener: -4149.08834659 hartree
oneelecener: -7411.72861384 hartree
twoeener: 3262.64026725 hartree
cpcmener: -0.03885055 hartree
kineticenergy: 1335.44198887 hartree
xcener: -127.805568765695 hartree
chargesum: -0.0000000
charge: -0.327979 -0.331410 -0.317636 -0.438677 -0.333471 -0.322472 0.193105 0.145815 0.209014 -0.224698 0.246801 0.022541 -0.105855 -0.134640 -0.116036 0.268889 0.222293 0.124603 -0.115096 -0.217569 -0.263735 -0.127193 -0.208089 0.216651 0.233075 -0.239627 -0.271836 -0.130871 -0.129752 0.087151 0.116235 0.108209 0.097519 0.098797 0.102400 0.113167 0.139058 0.131951 0.145222 0.118194 0.094943 0.098341 0.101601 0.115799 0.116949 0.109160 0.122027 0.110037 0.122720 0.111750 0.112629
qa: -0.3280 -0.3314 -0.3176 -0.4387 -0.3335 -0.3225 0.1931 0.1458 0.2090 -0.2247 0.2468 0.0225 -0.1059 -0.1346 -0.1160 0.2689 0.2223 0.1246 -0.1151 -0.2176 -0.2637 -0.1272 -0.2081 0.2167 0.2331 -0.2396 -0.2718 -0.1309 -0.1298 0.0872 0.1162 0.1082 0.0975 0.0988 0.1024 0.1132 0.1391 0.1320 0.1452 0.1182 0.0949 0.0983 0.1016 0.1158 0.1169 0.1092 0.1220 0.1100 0.1227 0.1118 0.1126
va: 2.1536 2.0789 2.1345 2.0482 2.0518 2.0658 3.6274 3.8337 4.0216 3.8526 4.0614 3.9261 3.6524 3.4969 3.9450 3.7845 3.8844 4.0238 3.9631 3.8582 4.0743 3.7274 3.9271 3.9471 3.9636 3.9468 3.9285 3.8820 3.8740 1.0293 1.0077 0.9899 1.0004 1.0061 1.0080 1.0000 1.0217 1.0361 1.0081 1.0342 1.0038 0.9992 0.9968 1.0109 1.0149 0.9862 0.9935 0.9878 0.9939 0.9861 0.9875
dispcorr: -0.025770011 hartree
energy: -1341.168123024110
dipole: 9.35003 -8.34437 1.00567 9.12295 -7.01241 2.11053 5.58529 -5.86467 -0.27938
magnitude: 2.35452 au
magnitude: 5.98471 debye
