program: Orca
programVersion: 5.0.2
elementType: O O O O O O C C C C C C C C C C C C C C C C C C C C C C C H H H H H H H H H H H H H H H H H H H H H H
charge: 0
multiplicity: 1
keywords: wb97x-d3
keywords: def2-TZVPP
keywords: def2/J RIJCOSX
keywords: DEFGRID2
keywords: scfconv7
keywords: smallprint printgap noloewdin
keywords: NOSOSCF
formula: C23H22O6
InChI: InChI=1/C23H22O6/c1-11(2)16-8-14-15(28-16)6-5-12-22(24)21-13-7-18(25-3)19(26-4)9-17(13)27-10-20(21)29-23(12)14/h5-7,9,16,20-21H,1,8,10H2,2-4H3
51 atoms
O  0.779124 0.854566 -1.339062
O  -1.562053 2.280957 -1.490327
O  3.865606 -0.67307 1.693636
O  -0.707396 -2.86002 -2.081786
O  -4.303313 -1.391142 1.522217
O  -4.544203 1.128584 2.011852
C  -1.075884 -0.500939 -2.155054
C  -0.093032 0.623441 -2.442849
C  1.296751 -0.2054 -0.707474
C  -2.028501 -0.053386 -1.065517
C  -0.325154 -1.753295 -1.752199
C  -0.853348 1.908283 -2.655069
C  2.3283 0.021568 0.182087
C  0.838929 -1.520558 -0.907407
C  2.992787 1.28604 0.620901
C  4.110648 0.738681 1.550483
C  2.895043 -1.045405 0.85299
C  -2.195577 1.29666 -0.805094
C  1.459618 -2.57578 -0.223925
C  -2.747652 -0.972044 -0.289333
C  2.491885 -2.365452 0.664702
C  5.488594 0.992509 1.005087
C  -3.039739 1.72664 0.221572
C  -3.586506 -0.567091 0.727413
C  -3.726052 0.811329 0.994436
C  5.938054 2.415453 1.133825
C  6.240971 0.043473 0.456325
C  -4.150653 -2.782761 1.342801
C  -4.67077 2.48964 2.371256
H  -1.620191 -0.716495 -3.079348
H  0.501499 0.394058 -3.334474
H  -0.18061 2.734578 -2.886036
H  -1.533974 1.780191 -3.503469
H  3.401157 1.859903 -0.214293
H  2.3066 1.943573 1.159475
H  4.032998 1.177213 2.549336
H  1.099295 -3.583467 -0.387635
H  -2.637432 -2.027956 -0.498006
H  2.958033 -3.182897 1.197636
H  -3.132177 2.79067 0.39742
H  5.236897 3.107837 0.659283
H  6.000784 2.709277 2.18547
H  6.916634 2.569522 0.681449
H  7.223085 0.27678 0.063682
H  5.926409 -0.988899 0.374556
H  -4.480879 -3.11036 0.352205
H  -4.777908 -3.261887 2.091995
H  -3.116556 -3.106687 1.495518
H  -5.101013 3.090123 1.564889
H  -3.71194 2.925336 2.666258
H  -5.344486 2.521367 3.224954
elementType: O C H
totalener: -1341.14197260 hartree
nucrepener: 2813.54452756 hartree
electener: -4154.68650015 hartree
oneelecener: -7422.91254804 hartree
twoeener: 3268.22604789 hartree
cpcmener: -0.03883009 hartree
kineticenergy: 1335.43323569 hartree
xcener: -127.803912440753 hartree
chargesum: -0.0000000
charge: -0.326176 -0.331270 -0.317670 -0.437373 -0.333528 -0.322599 0.196727 0.144093 0.206570 -0.224637 0.241027 0.022054 -0.102678 -0.134356 -0.120610 0.266299 0.230159 0.127584 -0.115205 -0.220495 -0.268917 -0.124325 -0.208742 0.218822 0.233028 -0.239111 -0.272315 -0.130939 -0.129889 0.085939 0.116251 0.108460 0.097471 0.098431 0.103759 0.112388 0.139108 0.132461 0.145448 0.118248 0.098638 0.101373 0.095170 0.115644 0.117091 0.109196 0.122011 0.110101 0.111612 0.112819 0.122855
qa: -0.3262 -0.3313 -0.3177 -0.4374 -0.3335 -0.3226 0.1967 0.1441 0.2066 -0.2246 0.2410 0.0221 -0.1027 -0.1344 -0.1206 0.2663 0.2302 0.1276 -0.1152 -0.2205 -0.2689 -0.1243 -0.2087 0.2188 0.2330 -0.2391 -0.2723 -0.1309 -0.1299 0.0859 0.1163 0.1085 0.0975 0.0984 0.1038 0.1124 0.1391 0.1325 0.1454 0.1182 0.0986 0.1014 0.0952 0.1156 0.1171 0.1092 0.1220 0.1101 0.1116 0.1128 0.1229
va: 2.1561 2.0784 2.1340 2.0491 2.0518 2.0657 3.6208 3.8345 4.0171 3.8495 4.0690 3.9238 3.6487 3.4948 3.9516 3.7853 3.8810 4.0206 3.9628 3.8577 4.0775 3.7295 3.9263 3.9426 3.9636 3.9462 3.9289 3.8820 3.8740 1.0294 1.0070 0.9899 1.0003 1.0059 1.0077 1.0005 1.0213 1.0348 1.0080 1.0341 0.9992 0.9970 1.0036 1.0108 1.0155 0.9862 0.9935 0.9878 0.9859 0.9877 0.9939
dispcorr: -0.025851509 hartree
energy: -1341.167824104997
dipole: 9.37814 -8.42224 0.95590 9.30303 -7.18729 2.11573 6.27877 -6.52761 -0.24884
magnitude: 2.33495 au
magnitude: 5.93498 debye
