program: Orca
programVersion: 5.0.2
elementType: O O O O O O C C C C C C C C C C C C C C C C C C C C C C C H H H H H H H H H H H H H H H H H H H H H H
charge: 0
multiplicity: 1
keywords: wb97x-d3
keywords: def2-TZVPP
keywords: def2/J RIJCOSX
keywords: DEFGRID2
keywords: scfconv7
keywords: smallprint printgap noloewdin
keywords: NOSOSCF
formula: C23H22O6
InChI: InChI=1/C23H22O6/c1-11(2)16-8-14-15(28-16)6-5-12-22(24)21-13-7-18(25-3)19(26-4)9-17(13)27-10-20(21)29-23(12)14/h5-7,9,16,20-21H,1,8,10H2,2-4H3
51 atoms
O  0.804303 0.868378 -1.176298
O  -1.567828 2.295141 -1.362824
O  4.086262 -0.713937 1.620871
O  -0.726213 -2.845217 -1.870154
O  -4.512228 -1.403265 1.413283
O  -4.806219 1.11434 1.892013
C  -1.044418 -0.484797 -2.020156
C  -0.059533 0.646007 -2.277659
C  1.360273 -0.202326 -0.594587
C  -2.054469 -0.042305 -0.982827
C  -0.307857 -1.743394 -1.591698
C  -0.819986 1.935163 -2.493487
C  2.443012 0.007731 0.235921
C  0.895079 -1.511467 -0.79559
C  3.136519 1.262696 0.655085
C  4.315642 0.694002 1.494261
C  3.056991 -1.069859 0.844075
C  -2.243005 1.303505 -0.727713
C  1.555544 -2.57696 -0.172397
C  -2.827067 -0.967416 -0.268851
C  2.642729 -2.384498 0.652273
C  5.652072 0.973423 0.863477
C  -3.163375 1.723803 0.234302
C  -3.740364 -0.572922 0.684547
C  -3.905926 0.803867 0.946019
C  6.090198 2.4032 0.965842
C  6.380779 0.037737 0.26765
C  -4.358765 -2.78264 1.215103
C  -4.993674 2.467164 2.211135
H  -1.550986 -0.715596 -2.963398
H  0.542148 0.423119 -3.169381
H  -0.138143 2.763063 -2.691938
H  -1.466601 1.812916 -3.371994
H  3.488976 1.849258 -0.195288
H  2.485768 1.909716 1.246537
H  4.306935 1.110602 2.506784
H  1.179832 -3.576418 -0.347153
H  -2.694242 -2.018706 -0.483894
H  3.146793 -3.209947 1.134196
H  -3.269569 2.787006 0.401233
H  7.044214 2.564656 0.467833
H  5.363597 3.087028 0.520206
H  6.202876 2.703678 2.010521
H  7.330084 0.284347 -0.189227
H  6.073646 -0.996567 0.215921
H  -4.609437 -3.087035 0.193356
H  -5.046738 -3.272522 1.900616
H  -3.341905 -3.123414 1.436879
H  -5.740694 2.498082 3.000976
H  -5.362826 3.047568 1.359305
H  -4.075805 2.936393 2.579893
totalener: -1341.11538322 hartree
nucrepener: 2798.96361775 hartree
electener: -4140.07900097 hartree
oneelecener: -7392.69382901 hartree
twoeener: 3252.61482805 hartree
kineticenergy: 1335.51975242 hartree
xcener: -127.814370815283 hartree
chargesum: 0.0000000
charge: -0.299262 -0.292905 -0.283976 -0.345778 -0.278110 -0.267153 0.146636 0.106464 0.202525 -0.210954 0.196483 0.021998 -0.104957 -0.124046 -0.123034 0.237439 0.204429 0.111538 -0.093819 -0.208754 -0.217421 -0.116541 -0.185148 0.229464 0.239066 -0.227325 -0.190885 -0.144086 -0.143296 0.079008 0.095390 0.092485 0.076434 0.081253 0.093414 0.094479 0.129889 0.128133 0.123094 0.095535 0.085097 0.086110 0.091189 0.084785 0.101467 0.098089 0.113427 0.099736 0.116193 0.097980 0.098219
qa: -0.2993 -0.2929 -0.2840 -0.3458 -0.2781 -0.2672 0.1466 0.1065 0.2025 -0.2110 0.1965 0.0220 -0.1050 -0.1240 -0.1230 0.2374 0.2044 0.1115 -0.0938 -0.2088 -0.2174 -0.1165 -0.1851 0.2295 0.2391 -0.2273 -0.1909 -0.1441 -0.1433 0.0790 0.0954 0.0925 0.0764 0.0813 0.0934 0.0945 0.1299 0.1281 0.1231 0.0955 0.0851 0.0861 0.0912 0.0848 0.1015 0.0981 0.1134 0.0997 0.1162 0.0980 0.0982
va: 2.1646 2.1166 2.1649 2.1408 2.1080 2.1206 3.6305 3.8628 4.0227 3.9110 4.0917 3.9654 3.6683 3.5781 3.9536 3.8332 3.9622 4.1122 3.9928 3.8928 4.0644 3.7624 3.9335 3.9493 3.9600 3.9537 3.9557 3.9189 3.9108 1.0273 1.0120 0.9916 1.0002 1.0098 1.0062 0.9991 1.0255 1.0356 1.0149 1.0383 1.0084 1.0009 0.9987 1.0151 1.0200 0.9864 0.9956 0.9875 0.9970 0.9862 0.9873
dispcorr: -0.025559288 hartree
energy: -1341.140942507717
dipole: 9.23119 -8.54938 0.68180 9.27096 -7.85814 1.41282 4.91014 -4.98920 -0.07906
magnitude: 1.57072 au
magnitude: 3.99245 debye
