program: Orca
programVersion: 5.0.2
elementType: O O O O O O C C C C C C C C C C C C C C C C C C C C C C C H H H H H H H H H H H H H H H H H H H H H H
charge: 0
multiplicity: 1
keywords: wb97x-d3
keywords: def2-TZVPP
keywords: def2/J RIJCOSX
keywords: DEFGRID2
keywords: scfconv7
keywords: smallprint printgap noloewdin
keywords: NOSOSCF
formula: C23H22O6
InChI: InChI=1/C23H22O6/c1-11(2)16-8-14-15(28-16)6-5-12-22(24)21-13-7-18(25-3)19(26-4)9-17(13)27-10-20(21)29-23(12)14/h5-7,9,16,20-21H,1,8,10H2,2-4H3
51 atoms
O  0.793155 0.816719 -1.206745
O  -1.571929 2.244729 -1.387493
O  4.142042 -0.658198 1.572431
O  -0.774749 -2.915187 -1.690386
O  -4.52747 -1.320717 1.546472
O  -4.791267 1.216643 1.938078
C  -1.0822 -0.562274 -1.947648
C  -0.099322 0.552153 -2.27533
C  1.358564 -0.230088 -0.592019
C  -2.07506 -0.071423 -0.915478
C  -0.341893 -1.804358 -1.4768
C  -0.858387 1.836045 -2.523597
C  2.462954 0.012554 0.200685
C  0.883084 -1.543968 -0.723959
C  3.180452 1.279802 0.533548
C  4.317894 0.769148 1.457701
C  3.090977 -1.040126 0.840181
C  -2.248698 1.284392 -0.70785
C  1.558167 -2.58407 -0.073647
C  -2.850562 -0.962166 -0.161909
C  2.667006 -2.360246 0.71347
C  5.691928 1.061339 0.926775
C  -3.1554 1.748241 0.24731
C  -3.752448 -0.52464 0.783768
C  -3.901515 0.862517 0.997652
C  6.099895 0.337676 -0.319215
C  6.466905 1.949379 1.539341
C  -4.40665 -2.707468 1.379665
C  -4.962526 2.581798 2.210647
H  -1.605811 -0.834209 -2.870418
H  0.478755 0.289122 -3.171662
H  -0.177831 2.651084 -2.773048
H  -1.529534 1.68355 -3.378761
H  3.571052 1.789726 -0.350244
H  2.541243 1.996123 1.051978
H  4.215668 1.185408 2.462635
H  1.175007 -3.588719 -0.194003
H  -2.729375 -2.021825 -0.339614
H  3.180709 -3.166476 1.217337
H  -3.250158 2.817831 0.376247
H  7.048743 0.710251 -0.701039
H  6.21115 -0.730733 -0.129539
H  5.356207 0.440417 -1.113036
H  7.439276 2.220877 1.150091
H  6.159096 2.441058 2.453619
H  -3.396748 -3.066735 1.604163
H  -4.67001 -3.028995 0.366359
H  -5.101873 -3.165478 2.079817
H  -5.704156 2.648249 3.003445
H  -5.331261 3.135623 1.341084
H  -4.03747 3.053913 2.557154
totalener: -1341.11601249 hartree
nucrepener: 2798.40259658 hartree
electener: -4139.51860907 hartree
oneelecener: -7391.53686335 hartree
twoeener: 3252.01825428 hartree
kineticenergy: 1335.51830694 hartree
xcener: -127.812512016534 hartree
chargesum: -0.0000000
charge: -0.297434 -0.292846 -0.287810 -0.346790 -0.277854 -0.267124 0.142856 0.107368 0.184930 -0.209248 0.201783 0.022151 -0.104946 -0.124460 -0.173055 0.272742 0.233625 0.111763 -0.096992 -0.210623 -0.229159 -0.128021 -0.185693 0.230166 0.238675 -0.217214 -0.176366 -0.144500 -0.143221 0.079458 0.094754 0.092741 0.076372 0.093241 0.096735 0.089966 0.129999 0.128528 0.123010 0.095456 0.085759 0.106824 0.085965 0.084267 0.079969 0.100049 0.098222 0.113393 0.116183 0.097713 0.098694
qa: -0.2974 -0.2928 -0.2878 -0.3468 -0.2779 -0.2671 0.1429 0.1074 0.1849 -0.2092 0.2018 0.0222 -0.1049 -0.1245 -0.1731 0.2727 0.2336 0.1118 -0.0970 -0.2106 -0.2292 -0.1280 -0.1857 0.2302 0.2387 -0.2172 -0.1764 -0.1445 -0.1432 0.0795 0.0948 0.0927 0.0764 0.0932 0.0967 0.0900 0.1300 0.1285 0.1230 0.0955 0.0858 0.1068 0.0860 0.0843 0.0800 0.1000 0.0982 0.1134 0.1162 0.0977 0.0987
va: 2.1649 2.1163 2.1581 2.1399 2.1081 2.1206 3.6350 3.8620 4.0502 3.9114 4.0894 3.9664 3.5996 3.5759 4.0060 3.7769 3.9334 4.1104 3.9965 3.8959 4.0778 3.8075 3.9347 3.9503 3.9599 3.9435 3.9551 3.9187 3.9107 1.0268 1.0118 0.9918 1.0006 1.0060 1.0109 1.0040 1.0254 1.0362 1.0150 1.0382 1.0093 1.0010 0.9988 1.0156 1.0197 0.9870 0.9867 0.9956 0.9970 0.9862 0.9872
dispcorr: -0.025767145 hartree
energy: -1341.141779635491
dipole: 9.19501 -8.52204 0.67298 7.18559 -5.97605 1.20953 3.40011 -3.68135 -0.28125
magnitude: 1.41243 au
magnitude: 3.59012 debye
