program: Orca
programVersion: 5.0.2
elementType: Cl O O N N N C C C C C C C C C C C C C C C C C C C C H H H H H H H H H H H H H H H H H H H H H H H H H H H H
charge: 0
multiplicity: 1
keywords: wb97x-d3
keywords: def2-TZVPP
keywords: def2/J RIJCOSX
keywords: DEFGRID2
keywords: scfconv7
keywords: smallprint printgap noloewdin
keywords: NOSOSCF
formula: C20H28ClN3O2
InChI: InChI=1/C20H28ClN3O2/c1-5-17-19(21)20(24-13-23-17)22-10-12-26-18-8-7-16(9-11-25-6-2)14(3)15(18)4/h7-8,13,22H,5-6,9-12H2,1-4H3
54 atoms
Cl 0.649365 -2.272439 -2.055561
O  2.384592 2.095043 -0.127473
O  -3.951432 1.825143 -0.928643
N  3.040039 -0.609806 -1.330352
N  2.895074 -1.017169 0.94042
N  1.098814 -2.24236 1.875774
C  -1.476028 0.538254 0.057221
C  -0.770333 0.875223 1.220995
C  0.532453 1.391254 1.139798
C  -2.865584 -0.044554 0.082425
C  1.118897 1.58501 -0.116713
C  -0.869443 0.76734 -1.171422
C  -3.958051 1.0030 0.219043
C  0.407923 1.288238 -1.272315
C  -1.367076 0.680338 2.587079
C  1.27484 1.736034 2.400003
C  3.254992 1.871396 -1.224611
C  3.940271 0.514361 -1.184861
C  -4.889772 2.882271 -0.882672
C  2.403991 -1.179223 -0.288367
C  1.245318 -1.964649 -0.460976
C  0.588766 -2.44637 0.651058
C  -0.688851 -3.220405 0.561862
C  -4.421178 4.066264 -0.058358
C  -0.440667 -4.707475 0.31792
C  2.222528 -1.556466 1.938439
H  -2.982522 -0.760868 0.897693
H  -3.035933 -0.611688 -0.836382
H  -1.399675 0.51151 -2.080568
H  -3.798356 1.589852 1.132061
H  -4.932596 0.507442 0.325299
H  0.833022 1.435901 -2.255408
H  -2.396256 0.334073 2.556844
H  -0.799239 -0.049433 3.168734
H  -1.357119 1.609192 3.160419
H  0.851749 2.624555 2.876013
H  1.212748 0.931824 3.134145
H  2.328507 1.934838 2.227935
H  2.756125 2.022298 -2.184665
H  4.025937 2.63955 -1.149011
H  4.5080 0.402081 -0.264837
H  4.657927 0.489199 -2.005962
H  2.559415 -0.652007 -2.216979
H  -5.855901 2.520779 -0.507635
H  -5.049456 3.196941 -1.91626
H  -1.322703 -2.817468 -0.229356
H  -1.227522 -3.089185 1.500655
H  -5.16579 4.861924 -0.103317
H  -4.279825 3.810918 0.992504
H  -3.482216 4.467372 -0.442026
H  0.074229 -4.880859 -0.626947
H  0.16264 -5.143412 1.114194
H  -1.386699 -5.247224 0.283779
H  2.647764 -1.416511 2.926047
elementType: Cl O N C H
totalener: -1554.02529859 hartree
nucrepener: 2750.66652516 hartree
electener: -4304.69182376 hartree
oneelecener: -7594.94116227 hartree
twoeener: 3290.24933851 hartree
cpcmener: -0.03638223 hartree
kineticenergy: 1548.40790843 hartree
xcener: -128.889018130948 hartree
chargesum: -0.0000000
charge: -0.099799 -0.365787 -0.396985 -0.193238 -0.386031 -0.394914 0.131787 -0.143274 -0.000233 -0.132199 0.300422 -0.263341 -0.016133 -0.208400 -0.313245 -0.294752 0.004879 -0.005681 0.046744 0.229647 -0.048471 0.218760 -0.137730 -0.252544 -0.259975 0.143154 0.096768 0.091974 0.125620 0.093159 0.096680 0.139383 0.091389 0.099945 0.117579 0.119115 0.099758 0.097754 0.101046 0.111541 0.096300 0.107550 0.167222 0.064875 0.091076 0.077100 0.087323 0.089837 0.081445 0.081108 0.083998 0.093603 0.097280 0.136909
qa: -0.0998 -0.3658 -0.3970 -0.1932 -0.3860 -0.3949 0.1318 -0.1433 -0.0002 -0.1322 0.3004 -0.2633 -0.0161 -0.2084 -0.3132 -0.2948 0.0049 -0.0057 0.0467 0.2296 -0.0485 0.2188 -0.1377 -0.2525 -0.2600 0.1432 0.0968 0.0920 0.1256 0.0932 0.0967 0.1394 0.0914 0.0999 0.1176 0.1191 0.0998 0.0978 0.1010 0.1115 0.0963 0.1076 0.1672 0.0649 0.0911 0.0771 0.0873 0.0898 0.0814 0.0811 0.0840 0.0936 0.0973 0.1369
va: 1.2362 2.0320 1.9065 3.2363 2.9679 2.9688 3.2740 3.6773 3.6167 3.8162 3.5797 3.9391 3.9749 3.8167 3.9143 3.9049 3.8892 3.8316 3.9127 4.1908 3.8922 3.7662 3.8896 3.8987 3.9350 4.0961 1.0033 1.0142 1.0163 0.9728 1.0018 1.0095 1.0108 1.0083 0.9918 0.9966 0.9919 1.0254 0.9957 1.0032 1.0323 1.0092 1.0307 0.9987 0.9919 1.0136 1.0192 1.0117 1.0035 1.0070 1.0079 1.0053 1.0041 0.9963
dispcorr: -0.035475027 hartree
energy: -1554.060773620058
dipole: -22.50276 22.14353 -0.35924 14.38966 -13.96729 0.42237 11.98435 -12.94392 -0.95957
magnitude: 1.10825 au
magnitude: 2.81696 debye
