program: Orca
programVersion: 5.0.2
elementType: Cl O O N N N C C C C C C C C C C C C C C C C C C C C H H H H H H H H H H H H H H H H H H H H H H H H H H H H
charge: 0
multiplicity: 1
keywords: wb97x-d3
keywords: def2-TZVPP
keywords: def2/J RIJCOSX
keywords: DEFGRID2
keywords: scfconv7
keywords: smallprint printgap noloewdin
keywords: NOSOSCF
formula: C20H28ClN3O2
InChI: InChI=1/C20H28ClN3O2/c1-5-17-19(21)20(24-13-23-17)22-10-12-26-18-8-7-16(9-11-25-6-2)14(3)15(18)4/h7-8,13,22H,5-6,9-12H2,1-4H3
54 atoms
Cl -0.050055 -1.881454 1.108735
O  2.87716 1.645713 -0.095808
O  -2.979566 0.358852 2.099489
N  2.8123 -1.113427 0.657651
N  2.754722 -1.419263 -1.632818
N  0.810373 -2.188502 -2.743361
C  -1.173559 2.218615 0.710569
C  -0.702627 2.085285 -0.603319
C  0.660845 1.862815 -0.854741
C  -2.620698 2.474484 1.04532
C  1.557086 1.777974 0.219297
C  -0.258494 2.107844 1.749781
C  -3.47793 1.218929 1.09771
C  1.08922 1.892076 1.523059
C  -1.628384 2.212863 -1.780806
C  1.137483 1.738414 -2.275082
C  3.812541 1.134319 0.837563
C  4.0417 -0.355278 0.631858
C  -3.495674 -0.955859 2.049673
C  2.129577 -1.440997 -0.454153
C  0.781918 -1.856369 -0.408746
C  0.149416 -2.227504 -1.576253
C  -1.288368 -2.636872 -1.617703
C  -4.961732 -1.062292 2.423761
C  -2.200156 -1.4172 -1.727708
C  2.062597 -1.780986 -2.695366
H  -3.079352 3.159531 0.329941
H  -2.67927 2.975601 2.014973
H  -0.600596 2.213805 2.772201
H  -3.473259 0.713844 0.122754
H  -4.51673 1.507182 1.301394
H  1.751751 1.837321 2.374975
H  -1.465913 3.158171 -2.30558
H  -1.465203 1.420884 -2.511779
H  -2.677849 2.175726 -1.501475
H  0.686016 0.876196 -2.771049
H  0.857817 2.614006 -2.864239
H  2.214471 1.628535 -2.353426
H  4.752544 1.661258 0.665625
H  3.523451 1.335294 1.869068
H  4.702852 -0.709678 1.423857
H  4.546533 -0.537983 -0.312333
H  2.281338 -1.049585 1.51359
H  -2.897251 -1.53979 2.751742
H  -3.336944 -1.389107 1.053789
H  -1.549691 -3.21484 -0.731136
H  -1.436921 -3.285264 -2.480846
H  -5.155525 -0.627122 3.405204
H  -5.614266 -0.575966 1.697795
H  -5.24837 -2.113817 2.465116
H  -3.246614 -1.721182 -1.723122
H  -2.047519 -0.72982 -0.896079
H  -2.01518 -0.871274 -2.652473
H  2.59321 -1.74188 -3.640248
elementType: Cl O N C H
totalener: -1554.02682225 hartree
nucrepener: 2773.76870029 hartree
electener: -4327.79552254 hartree
oneelecener: -7640.78576308 hartree
twoeener: 3312.99024054 hartree
cpcmener: -0.03648511 hartree
kineticenergy: 1548.40819717 hartree
xcener: -128.888297717465 hartree
chargesum: -0.0000000
charge: -0.101029 -0.360162 -0.399123 -0.186142 -0.392696 -0.405914 0.184786 -0.194883 0.013276 -0.105636 0.223389 -0.255369 -0.028779 -0.194576 -0.328530 -0.303874 0.004736 -0.007180 0.064720 0.284436 -0.102595 0.230550 -0.109559 -0.269685 -0.250147 0.144923 0.099191 0.090252 0.132623 0.089046 0.104526 0.146245 0.123443 0.103127 0.100582 0.095955 0.120815 0.097456 0.107123 0.103907 0.105418 0.101047 0.166169 0.090133 0.055197 0.086026 0.083034 0.085413 0.088748 0.092720 0.110606 0.021347 0.111666 0.133245
qa: -0.1010 -0.3602 -0.3991 -0.1861 -0.3927 -0.4059 0.1848 -0.1949 0.0133 -0.1056 0.2234 -0.2554 -0.0288 -0.1946 -0.3285 -0.3039 0.0047 -0.0072 0.0647 0.2844 -0.1026 0.2306 -0.1096 -0.2697 -0.2501 0.1449 0.0992 0.0903 0.1326 0.0890 0.1045 0.1462 0.1234 0.1031 0.1006 0.0960 0.1208 0.0975 0.1071 0.1039 0.1054 0.1010 0.1662 0.0901 0.0552 0.0860 0.0830 0.0854 0.0887 0.0927 0.1106 0.0213 0.1117 0.1332
va: 1.2464 2.0265 1.8861 3.2444 2.9712 2.9907 3.3047 3.7028 3.5663 3.8134 3.7469 4.0119 3.9357 3.8523 3.9242 3.9027 3.8854 3.8111 3.8907 4.0587 3.8603 3.7619 3.8864 3.9349 3.9314 4.1072 1.0028 1.0109 1.0110 0.9760 0.9996 1.0017 0.9976 0.9898 1.0065 0.9975 0.9985 1.0277 1.0056 0.9972 1.0088 1.0345 1.0346 0.9876 0.9921 1.0145 1.0268 1.0071 0.9983 1.0089 1.0056 0.9872 1.0064 0.9978
dispcorr: -0.036179992 hartree
energy: -1554.063002239578
dipole: -23.53347 23.12686 -0.40661 9.88840 -9.78807 0.10033 -2.25519 3.33863 1.08344
magnitude: 1.16157 au
magnitude: 2.95247 debye
