program: Orca
programVersion: 5.0.2
elementType: Cl O O N N N C C C C C C C C C C C C C C C C C C C C H H H H H H H H H H H H H H H H H H H H H H H H H H H H
charge: 0
multiplicity: 1
keywords: wb97x-d3
keywords: def2-TZVPP
keywords: def2/J RIJCOSX
keywords: DEFGRID2
keywords: scfconv7
keywords: smallprint printgap noloewdin
keywords: NOSOSCF
formula: C20H28ClN3O2
InChI: InChI=1/C20H28ClN3O2/c1-5-17-19(21)20(24-13-23-17)22-10-12-26-18-8-7-16(9-11-25-6-2)14(3)15(18)4/h7-8,13,22H,5-6,9-12H2,1-4H3
54 atoms
Cl 1.671327 -1.676105 2.020436
O  2.289302 2.291355 -0.775589
O  -4.027664 1.550809 -0.40616
N  3.31944 -0.371963 -0.127538
N  2.240758 -1.412979 -1.878902
N  0.325646 -2.761278 -1.533668
C  -1.341675 0.581032 0.351068
C  -0.475379 1.114957 1.313359
C  0.761492 1.662655 0.931336
C  -2.660387 -0.055583 0.706666
C  1.09863 1.710886 -0.422314
C  -0.975495 0.654846 -0.989816
C  -3.792748 0.948379 0.845662
C  0.221323 1.222848 -1.383515
C  -0.812417 1.089302 2.777461
C  1.708916 2.167354 1.981125
C  3.132068 1.591348 -1.68113
C  4.016213 0.566848 -0.983744
C  -5.020925 2.553286 -0.362707
C  2.35384 -1.197058 -0.566748
C  1.468109 -1.850062 0.311775
C  0.433583 -2.601098 -0.208437
C  -0.589573 -3.245008 0.679322
C  -5.258957 3.07491 -1.760097
C  -1.78223 -3.843084 -0.043927
C  1.243148 -2.176684 -2.278585
H  -2.59133 -0.620781 1.637424
H  -2.930356 -0.783859 -0.062513
H  -1.637818 0.251729 -1.746343
H  -3.536865 1.707069 1.598439
H  -4.697599 0.437958 1.203142
H  0.462564 1.279462 -2.437016
H  -1.838277 0.790203 2.973877
H  -0.163644 0.396293 3.318621
H  -0.672154 2.069785 3.235374
H  1.854366 1.426542 2.768878
H  2.688035 2.410192 1.576915
H  1.326717 3.068194 2.467269
H  2.557468 1.127148 -2.482626
H  3.780465 2.337341 -2.142952
H  4.73918 1.074956 -0.347836
H  4.589647 0.040879 -1.748647
H  3.284309 -0.11793 0.847137
H  -4.708642 3.37183 0.299706
H  -5.954403 2.149862 0.052091
H  -0.93597 -2.503908 1.404493
H  -0.091705 -4.01613 1.275611
H  -6.019706 3.855076 -1.737868
H  -4.352845 3.506665 -2.186991
H  -5.61143 2.286315 -2.426059
H  -1.495852 -4.649415 -0.716874
H  -2.478892 -4.254537 0.686291
H  -2.319985 -3.095026 -0.62642
H  1.169629 -2.337848 -3.348552
elementType: Cl O N C H
totalener: -1554.02630293 hartree
nucrepener: 2747.64616878 hartree
electener: -4301.67247170 hartree
oneelecener: -7588.45254805 hartree
twoeener: 3286.78007635 hartree
cpcmener: -0.03343899 hartree
kineticenergy: 1548.40785859 hartree
xcener: -128.887890356079 hartree
chargesum: -0.0000000
charge: -0.101050 -0.386372 -0.390574 -0.191309 -0.393309 -0.405783 0.164175 -0.142958 -0.031469 -0.137982 0.256073 -0.258176 -0.004371 -0.180281 -0.304171 -0.281818 0.029475 -0.050189 0.061719 0.252707 -0.064242 0.209766 -0.101175 -0.258181 -0.266835 0.141527 0.101695 0.087132 0.130010 0.091490 0.093485 0.142267 0.091572 0.099326 0.113901 0.095576 0.096176 0.118149 0.098083 0.110751 0.114368 0.097065 0.177983 0.071904 0.068082 0.081699 0.111571 0.085685 0.083562 0.082539 0.084344 0.098162 0.078259 0.129967
qa: -0.1010 -0.3864 -0.3906 -0.1913 -0.3933 -0.4058 0.1642 -0.1430 -0.0315 -0.1380 0.2561 -0.2582 -0.0044 -0.1803 -0.3042 -0.2818 0.0295 -0.0502 0.0617 0.2527 -0.0642 0.2098 -0.1012 -0.2582 -0.2668 0.1415 0.1017 0.0871 0.1300 0.0915 0.0935 0.1423 0.0916 0.0993 0.1139 0.0956 0.0962 0.1181 0.0981 0.1108 0.1144 0.0971 0.1780 0.0719 0.0681 0.0817 0.1116 0.0857 0.0836 0.0825 0.0843 0.0982 0.0783 0.1300
va: 1.2477 2.0037 1.9183 3.2108 2.9726 2.9579 3.2256 3.6607 3.6929 3.8292 3.6363 3.9058 3.9600 3.8363 3.9198 3.9072 3.8171 3.8536 3.8793 4.1332 3.9780 3.7695 3.8833 3.9591 3.9279 4.1285 1.0000 1.0192 1.0157 0.9868 0.9994 1.0001 1.0101 1.0019 0.9924 0.9961 1.0227 0.9984 1.0136 1.0065 0.9995 1.0200 1.0229 0.9891 0.9876 0.9982 1.0019 1.0085 1.0034 1.0046 1.0136 1.0047 1.0093 0.9966
dispcorr: -0.035375198 hartree
energy: -1554.061678123779
dipole: -27.08283 27.27761 0.19478 12.97165 -12.49702 0.47463 0.57182 0.93025 1.50207
magnitude: 1.58727 au
magnitude: 4.03453 debye
