program: Orca
programVersion: 5.0.2
elementType: Cl O O N N N C C C C C C C C C C C C C C C C C C C C H H H H H H H H H H H H H H H H H H H H H H H H H H H H
charge: 0
multiplicity: 1
keywords: wb97x-d3
keywords: def2-TZVPP
keywords: def2/J RIJCOSX
keywords: DEFGRID2
keywords: scfconv7
keywords: smallprint printgap noloewdin
keywords: NOSOSCF
formula: C20H28ClN3O2
InChI: InChI=1/C20H28ClN3O2/c1-5-17-19(21)20(24-13-23-17)22-10-12-26-18-8-7-16(9-11-25-6-2)14(3)15(18)4/h7-8,13,22H,5-6,9-12H2,1-4H3
54 atoms
Cl 0.204724 -2.328197 1.292194
O  2.796152 2.040571 0.417024
O  -3.719009 0.924973 1.799647
N  2.865086 -0.991822 0.871415
N  2.6767 -0.884738 -1.429875
N  0.727644 -1.613191 -2.558392
C  -1.253231 1.20196 -0.120276
C  -0.454407 1.656691 -1.181559
C  0.910069 1.918673 -0.994727
C  -2.691767 0.813459 -0.372888
C  1.466625 1.759325 0.280039
C  -0.670021 1.082162 1.134853
C  -3.39588 0.057605 0.734413
C  0.668922 1.365255 1.343823
C  -1.046671 1.823545 -2.553997
C  1.758682 2.355553 -2.156349
C  3.582314 1.345639 1.372763
C  3.970347 -0.058675 0.942606
C  -4.283152 0.240512 2.899325
C  2.150869 -1.213361 -0.248394
C  0.87851 -1.817405 -0.21699
C  0.176018 -1.979546 -1.394408
C  -1.20496 -2.565386 -1.40755
C  -4.595824 1.227185 3.998712
C  -1.914768 -2.50717 -2.747566
C  1.941407 -1.099615 -2.501503
H  -2.732516 0.173541 -1.258286
H  -3.289439 1.694377 -0.631114
H  -1.251448 0.754241 1.984827
H  -2.769102 -0.773576 1.088521
H  -4.311491 -0.392417 0.327946
H  1.073121 1.253525 2.340859
H  -0.894999 0.927429 -3.162246
H  -2.117651 2.011314 -2.521942
H  -0.595028 2.654091 -3.09414
H  1.562419 1.751062 -3.042069
H  1.554436 3.393284 -2.4323
H  2.821865 2.283637 -1.9466
H  4.498633 1.928758 1.473496
H  3.111109 1.330978 2.35894
H  4.688272 -0.431612 1.6749
H  4.480437 -0.034184 -0.016887
H  2.377728 -1.134322 1.743752
H  -3.588081 -0.526168 3.266934
H  -5.197866 -0.284867 2.592933
H  -1.807617 -2.053888 -0.652554
H  -1.141782 -3.602987 -1.065031
H  -3.697062 1.739732 4.343821
H  -5.316211 1.977812 3.671633
H  -5.027052 0.702473 4.851034
H  -2.021791 -1.483139 -3.10613
H  -1.39509 -3.078089 -3.515194
H  -2.915691 -2.926048 -2.645209
H  2.390693 -0.820755 -3.448576
elementType: Cl O N C H
totalener: -1554.02476118 hartree
nucrepener: 2770.17904669 hartree
electener: -4324.20380787 hartree
oneelecener: -7633.24151435 hartree
twoeener: 3309.03770648 hartree
cpcmener: -0.03468957 hartree
kineticenergy: 1548.39871301 hartree
xcener: -128.889695091165 hartree
chargesum: -0.0000000
charge: -0.101603 -0.370230 -0.401770 -0.187598 -0.385104 -0.399512 0.036993 -0.145912 0.025565 -0.087337 0.288980 -0.208446 -0.012762 -0.228615 -0.317455 -0.295833 0.010017 -0.011504 0.055561 0.238152 -0.067682 0.206570 -0.096446 -0.254994 -0.271666 0.130597 0.090311 0.092890 0.135897 0.088298 0.104077 0.138294 0.097487 0.108363 0.113222 0.101806 0.116115 0.095129 0.110938 0.100365 0.107670 0.097377 0.166221 0.072861 0.079669 0.070448 0.110599 0.083964 0.082545 0.085609 0.080040 0.086379 0.100111 0.135349
qa: -0.1016 -0.3702 -0.4018 -0.1876 -0.3851 -0.3995 0.0370 -0.1459 0.0256 -0.0873 0.2890 -0.2084 -0.0128 -0.2286 -0.3175 -0.2958 0.0100 -0.0115 0.0556 0.2382 -0.0677 0.2066 -0.0964 -0.2550 -0.2717 0.1306 0.0903 0.0929 0.1359 0.0883 0.1041 0.1383 0.0975 0.1084 0.1132 0.1018 0.1161 0.0951 0.1109 0.1004 0.1077 0.0974 0.1662 0.0729 0.0797 0.0704 0.1106 0.0840 0.0825 0.0856 0.0800 0.0864 0.1001 0.1353
va: 1.2415 2.0281 1.9022 3.2271 2.9697 2.9387 3.5244 3.7314 3.6058 3.8940 3.5880 3.8166 3.9129 3.8976 3.9242 3.9191 3.8833 3.8331 3.8681 4.1966 3.9534 3.7642 3.8847 3.9556 3.9471 4.1092 0.9942 1.0159 1.0072 0.9964 1.0007 1.0093 1.0029 0.9987 0.9969 0.9883 0.9962 1.0248 1.0041 0.9963 1.0087 1.0330 1.0315 0.9878 0.9912 1.0042 1.0044 1.0030 1.0047 1.0077 1.0002 1.0124 1.0045 0.9953
dispcorr: -0.036327410 hartree
energy: -1554.061088588038
dipole: -21.12898 21.06790 -0.06107 10.37981 -11.30672 -0.92691 -2.38657 3.89421 1.50764
magnitude: 1.77084 au
magnitude: 4.50112 debye
