program: Orca
programVersion: 5.0.2
elementType: Cl O O N N N C C C C C C C C C C C C C C C C C C C C H H H H H H H H H H H H H H H H H H H H H H H H H H H H
charge: 0
multiplicity: 1
keywords: wb97x-d3
keywords: def2-TZVPP
keywords: def2/J RIJCOSX
keywords: DEFGRID2
keywords: scfconv7
keywords: smallprint printgap noloewdin
keywords: NOSOSCF
formula: C20H28ClN3O2
InChI: InChI=1/C20H28ClN3O2/c1-5-17-19(21)20(24-13-23-17)22-10-12-26-18-8-7-16(9-11-25-6-2)14(3)15(18)4/h7-8,13,22H,5-6,9-12H2,1-4H3
54 atoms
Cl -0.004007 -1.694339 1.389978
O  2.956812 1.705349 -0.160313
O  -2.940697 0.455259 2.210597
N  2.843486 -1.090617 0.692043
N  2.590052 -1.481404 -1.574939
N  0.489198 -2.041809 -2.514292
C  -1.120573 2.180657 0.579505
C  -0.637244 1.954014 -0.716559
C  0.73881 1.793503 -0.94842
C  -2.580329 2.405604 0.87884
C  1.628304 1.82158 0.131726
C  -0.206272 2.209183 1.626355
C  -3.389339 1.130539 1.055527
C  1.149761 2.028612 1.420744
C  -1.560621 1.865411 -1.899422
C  1.230027 1.629288 -2.358867
C  3.869152 1.151856 0.774285
C  4.070951 -0.337769 0.553088
C  -3.825331 -0.539336 2.685661
C  2.056187 -1.411002 -0.353511
C  0.69085 -1.712288 -0.192445
C  -0.080391 -1.988146 -1.303865
C  -1.558871 -2.210321 -1.189506
C  -3.940583 -1.76193 1.794989
C  -2.288148 -2.39625 -2.506719
C  1.784302 -1.794555 -2.569593
H  -3.055097 2.992439 0.090783
H  -2.674218 3.003624 1.78916
H  -0.557675 2.396099 2.63394
H  -3.297708 0.498645 0.162177
H  -4.45203 1.391158 1.154487
H  1.814639 2.076825 2.271832
H  -2.605754 2.007565 -1.638219
H  -1.310993 2.609031 -2.659718
H  -1.483291 0.888893 -2.385054
H  0.711473 0.819997 -2.873746
H  1.040787 2.534072 -2.942257
H  2.294668 1.425605 -2.4189
H  4.822818 1.660031 0.622265
H  3.570664 1.341164 1.806386
H  4.794109 -0.689716 1.290689
H  4.49674 -0.528579 -0.42853
H  2.374426 -0.970345 1.578025
H  -4.822365 -0.108436 2.848765
H  -3.44349 -0.836612 3.664487
H  -1.989936 -1.36202 -0.648817
H  -1.732923 -3.076274 -0.543713
H  -4.586478 -2.496592 2.277141
H  -4.379106 -1.532466 0.823253
H  -2.969703 -2.230299 1.631602
H  -1.937218 -3.271927 -3.050877
H  -3.351897 -2.532246 -2.31364
H  -2.179702 -1.529824 -3.158757
H  2.244405 -1.856329 -3.549912
elementType: Cl O N C H
totalener: -1554.02466779 hartree
nucrepener: 2787.02221657 hartree
electener: -4341.04688436 hartree
oneelecener: -7667.44099300 hartree
twoeener: 3326.39410863 hartree
cpcmener: -0.03553846 hartree
kineticenergy: 1548.39100717 hartree
xcener: -128.885512869198 hartree
chargesum: 0.0000000
charge: -0.102134 -0.368229 -0.390048 -0.184500 -0.393085 -0.407795 0.185298 -0.203758 0.031716 -0.123790 0.214722 -0.234467 -0.018976 -0.196815 -0.305849 -0.313211 0.009505 -0.011157 0.029770 0.265252 -0.100381 0.236490 -0.072331 -0.269762 -0.272318 0.140136 0.099052 0.090361 0.133667 0.087043 0.103378 0.144189 0.095221 0.115062 0.099104 0.097803 0.124849 0.096557 0.106333 0.103418 0.103442 0.101837 0.162427 0.074979 0.092664 0.050622 0.105489 0.104038 0.091591 0.074181 0.086993 0.097493 0.080729 0.133194
qa: -0.1021 -0.3682 -0.3900 -0.1845 -0.3931 -0.4078 0.1853 -0.2038 0.0317 -0.1238 0.2147 -0.2345 -0.0190 -0.1968 -0.3058 -0.3132 0.0095 -0.0112 0.0298 0.2653 -0.1004 0.2365 -0.0723 -0.2698 -0.2723 0.1401 0.0991 0.0904 0.1337 0.0870 0.1034 0.1442 0.0952 0.1151 0.0991 0.0978 0.1248 0.0966 0.1063 0.1034 0.1034 0.1018 0.1624 0.0750 0.0927 0.0506 0.1055 0.1040 0.0916 0.0742 0.0870 0.0975 0.0807 0.1332
va: 1.2528 2.0194 1.9025 3.2242 2.9792 2.9565 3.2886 3.7427 3.5621 3.8534 3.7333 3.9859 3.9270 3.8700 3.9267 3.8986 3.8845 3.8191 3.9106 4.0918 3.9073 3.7290 3.8947 3.8800 3.9571 4.1040 1.0023 1.0120 1.0101 0.9627 1.0018 1.0020 1.0093 0.9990 0.9915 0.9971 0.9979 1.0265 1.0070 0.9981 1.0100 1.0338 1.0372 1.0002 0.9922 0.9864 1.0010 1.0143 0.9971 1.0073 1.0104 1.0044 1.0055 0.9969
dispcorr: -0.036501723 hartree
energy: -1554.061169513809
dipole: -22.05493 21.52616 -0.52878 5.74597 -5.61491 0.13106 -5.57670 6.77317 1.19647
magnitude: 1.31465 au
magnitude: 3.34159 debye
