program: Orca
programVersion: 5.0.2
elementType: Cl O O N N N C C C C C C C C C C C C C C C C C C C C H H H H H H H H H H H H H H H H H H H H H H H H H H H H
charge: 0
multiplicity: 1
keywords: wb97x-d3
keywords: def2-TZVPP
keywords: def2/J RIJCOSX
keywords: DEFGRID2
keywords: scfconv7
keywords: smallprint printgap noloewdin
keywords: NOSOSCF
formula: C20H28ClN3O2
InChI: InChI=1/C20H28ClN3O2/c1-5-17-19(21)20(24-13-23-17)22-10-12-26-18-8-7-16(9-11-25-6-2)14(3)15(18)4/h7-8,13,22H,5-6,9-12H2,1-4H3
54 atoms
Cl 0.146234 -1.584778 1.314294
O  3.211897 2.124338 0.001463
O  -4.441125 0.857418 0.540466
N  2.828073 -0.803512 0.226993
N  2.34284 -1.324625 -1.960581
N  0.212184 -2.117416 -2.615999
C  -0.949966 2.099188 0.130393
C  -0.196459 2.158427 1.309777
C  1.205757 2.119107 1.258857
C  -2.456236 2.10717 0.131868
C  1.845076 2.060692 0.018594
C  -0.278866 2.011748 -1.085308
C  -3.032834 0.751072 0.50784
C  1.1027 2.004793 -1.15466
C  -0.853504 2.23458 2.658241
C  1.998781 2.127396 2.533358
C  3.928247 1.193879 -0.79806
C  4.076939 -0.155872 -0.118238
C  -5.097846 -0.215686 1.185595
C  1.950227 -1.240025 -0.689188
C  0.639202 -1.640073 -0.346217
C  -0.210405 -2.071385 -1.340902
C  -1.606296 -2.544761 -1.09008
C  -5.083677 -1.515562 0.406077
C  -1.688571 -4.068948 -1.095196
C  1.455829 -1.752098 -2.840023
H  -2.812224 2.379051 -0.86445
H  -2.842139 2.86606 0.817095
H  -0.85095 1.968643 -2.004487
H  -2.651037 0.428519 1.486032
H  -2.704519 0.003153 -0.224237
H  1.588468 1.974896 -2.121403
H  -1.91533 2.460765 2.599265
H  -0.753929 1.289943 3.198775
H  -0.394895 3.002003 3.283129
H  3.045353 1.880375 2.374198
H  1.967941 3.104659 3.021996
H  1.598831 1.407329 3.24903
H  3.480502 1.086807 -1.787028
H  4.924018 1.615978 -0.9400
H  4.635886 -0.042422 0.809686
H  4.671294 -0.800873 -0.766346
H  2.47227 -0.609128 1.149885
H  -6.129823 0.10962 1.332261
H  -4.667752 -0.377145 2.183049
H  -2.248832 -2.14007 -1.87398
H  -1.983417 -2.16462 -0.142956
H  -5.705018 -2.25196 0.917618
H  -5.486286 -1.381935 -0.599114
H  -4.083383 -1.940141 0.320584
H  -2.717109 -4.390054 -0.930185
H  -1.359364 -4.483924 -2.047445
H  -1.072391 -4.501221 -0.306363
H  1.798007 -1.80588 -3.867466
elementType: Cl O N C H
totalener: -1554.02653076 hartree
nucrepener: 2732.28649446 hartree
electener: -4286.31302523 hartree
oneelecener: -7556.36223566 hartree
twoeener: 3270.04921043 hartree
cpcmener: -0.03194273 hartree
kineticenergy: 1548.41106564 hartree
xcener: -128.885000816804 hartree
chargesum: -0.0000000
charge: -0.099626 -0.382215 -0.404387 -0.182880 -0.403184 -0.418373 0.137884 -0.186443 0.013744 -0.066431 0.164986 -0.287593 0.012950 -0.109239 -0.320053 -0.277275 0.026792 -0.042398 0.048673 0.279810 -0.101114 0.270471 -0.138691 -0.260209 -0.256832 0.149677 0.087506 0.089269 0.131467 0.079743 0.077724 0.146143 0.102104 0.107184 0.113073 0.095610 0.115596 0.100254 0.097500 0.111677 0.115603 0.096388 0.178482 0.093610 0.068916 0.095818 0.061282 0.095594 0.083595 0.078684 0.096151 0.090143 0.091368 0.131474
qa: -0.0996 -0.3822 -0.4044 -0.1829 -0.4032 -0.4184 0.1379 -0.1864 0.0137 -0.0664 0.1650 -0.2876 0.0130 -0.1092 -0.3201 -0.2773 0.0268 -0.0424 0.0487 0.2798 -0.1011 0.2705 -0.1387 -0.2602 -0.2568 0.1497 0.0875 0.0893 0.1315 0.0797 0.0777 0.1461 0.1021 0.1072 0.1131 0.0956 0.1156 0.1003 0.0975 0.1117 0.1156 0.0964 0.1785 0.0936 0.0689 0.0958 0.0613 0.0956 0.0836 0.0787 0.0962 0.0901 0.0914 0.1315
va: 1.2320 2.0052 1.9255 3.2297 2.9659 2.9991 3.4309 3.7159 3.6360 3.7527 3.7853 3.9200 3.9484 3.7580 3.9200 3.9123 3.8223 3.8436 3.9042 4.0415 3.8904 3.7105 3.9222 3.8791 3.9247 4.1294 1.0154 1.0123 1.0074 0.9888 0.9798 0.9975 1.0029 0.9932 0.9975 1.0213 0.9970 0.9937 1.0137 1.0070 1.0001 1.0259 1.0224 0.9916 0.9995 1.0106 1.0081 1.0128 1.0099 0.9898 1.0038 1.0126 1.0003 0.9957
dispcorr: -0.034651941 hartree
energy: -1554.061182702048
dipole: -19.23138 19.89532 0.66394 0.99951 -1.64470 -0.64520 6.13050 -4.68772 1.44277
magnitude: 1.71426 au
magnitude: 4.35730 debye
