program: Orca
programVersion: 5.0.2
elementType: Cl O O N N N C C C C C C C C C C C C C C C C C C C C H H H H H H H H H H H H H H H H H H H H H H H H H H H H
charge: 0
multiplicity: 1
keywords: wb97x-d3
keywords: def2-TZVPP
keywords: def2/J RIJCOSX
keywords: DEFGRID2
keywords: scfconv7
keywords: smallprint printgap noloewdin
keywords: NOSOSCF
formula: C20H28ClN3O2
InChI: InChI=1/C20H28ClN3O2/c1-5-17-19(21)20(24-13-23-17)22-10-12-26-18-8-7-16(9-11-25-6-2)14(3)15(18)4/h7-8,13,22H,5-6,9-12H2,1-4H3
54 atoms
Cl -0.207536 -1.291948 -2.239527
O  2.998167 1.87561 0.04144
O  -3.584022 0.992026 -1.144057
N  2.652661 -0.611919 -1.666857
N  2.64088 -1.440937 0.491973
N  0.664127 -2.279857 1.488723
C  -1.098503 1.5188 0.764718
C  -0.149456 1.330577 1.784385
C  1.222438 1.446794 1.522796
C  -2.577442 1.422843 1.072314
C  1.651815 1.74729 0.224114
C  -0.631174 1.816644 -0.509863
C  -3.54097 1.851723 -0.023237
C  0.721894 1.934923 -0.786452
C  -0.56851 0.997787 3.18942
C  2.210646 1.270868 2.640873
C  3.599592 1.641826 -1.220771
C  3.858247 0.169236 -1.497292
C  -4.420146 -0.136089 -0.976947
C  1.989867 -1.182923 -0.6434
C  0.631518 -1.540434 -0.746293
C  -0.017931 -2.052316 0.358807
C  -1.485567 -2.356852 0.328622
C  -4.376475 -0.967039 -2.237892
C  -2.123474 -2.591101 1.685412
C  1.946506 -1.972033 1.478501
H  -2.805197 2.057895 1.933114
H  -2.825853 0.40687 1.399694
H  -1.320102 1.962747 -1.329387
H  -3.268246 2.843385 -0.393774
H  -4.542034 1.945274 0.415915
H  1.024465 2.168364 -1.79817
H  -0.160774 0.035689 3.506468
H  -0.197733 1.739104 3.900816
H  -1.64604 0.943799 3.312638
H  2.010849 0.365795 3.215559
H  3.236923 1.210636 2.290952
H  2.157894 2.104109 3.346552
H  3.03064 2.089139 -2.039364
H  4.561216 2.156042 -1.18881
H  4.464794 -0.267839 -0.708021
H  4.439726 0.106548 -2.417736
H  2.088363 -0.34685 -2.460213
H  -5.449665 0.186101 -0.772007
H  -4.104671 -0.744273 -0.120022
H  -1.642826 -3.229153 -0.314126
H  -1.996729 -1.534619 -0.176516
H  -4.70869 -0.394326 -3.104922
H  -3.370943 -1.340153 -2.43749
H  -5.036303 -1.828162 -2.135313
H  -1.972434 -1.744051 2.355162
H  -3.197919 -2.726188 1.562637
H  -1.733619 -3.480376 2.177699
H  2.498514 -2.180909 2.388445
elementType: Cl O N C H
totalener: -1554.02349728 hartree
nucrepener: 2811.91473634 hartree
electener: -4365.93823362 hartree
oneelecener: -7717.18533739 hartree
twoeener: 3351.24710376 hartree
cpcmener: -0.03456296 hartree
kineticenergy: 1548.39394030 hartree
xcener: -128.891100608369 hartree
chargesum: 0.0000000
charge: -0.105259 -0.366644 -0.414796 -0.190204 -0.385000 -0.401174 0.113458 -0.175228 0.014476 -0.118640 0.291994 -0.240231 0.027311 -0.219355 -0.324888 -0.292518 0.003473 -0.005651 0.049458 0.228492 -0.051755 0.190397 -0.031754 -0.264742 -0.289623 0.133684 0.100699 0.084582 0.125937 0.098249 0.101209 0.135759 0.096585 0.118288 0.101758 0.099103 0.096448 0.119071 0.101288 0.111644 0.096890 0.107645 0.165276 0.090540 0.071279 0.114490 0.015939 0.090064 0.077288 0.088798 0.082604 0.103791 0.093550 0.135947
qa: -0.1053 -0.3666 -0.4148 -0.1902 -0.3850 -0.4012 0.1135 -0.1752 0.0145 -0.1186 0.2920 -0.2402 0.0273 -0.2194 -0.3249 -0.2925 0.0035 -0.0057 0.0495 0.2285 -0.0518 0.1904 -0.0318 -0.2647 -0.2896 0.1337 0.1007 0.0846 0.1259 0.0982 0.1012 0.1358 0.0966 0.1183 0.1018 0.0991 0.0964 0.1191 0.1013 0.1116 0.0969 0.1076 0.1653 0.0905 0.0713 0.1145 0.0159 0.0901 0.0773 0.0888 0.0826 0.1038 0.0935 0.1359
va: 1.2395 2.0297 1.8664 3.2268 2.9716 2.9444 3.3910 3.7435 3.6141 3.8374 3.5923 3.8657 3.8710 3.8931 3.9193 3.9060 3.8895 3.8311 3.8709 4.1928 3.9089 3.8264 3.8481 3.9470 3.9492 4.1058 1.0072 0.9919 1.0323 0.9958 0.9988 1.0121 1.0027 0.9970 1.0024 0.9918 1.0261 0.9970 0.9963 1.0040 1.0318 1.0092 1.0329 0.9955 0.9710 1.0044 1.0094 1.0066 1.0031 1.0086 0.9981 1.0030 1.0160 0.9956
dispcorr: -0.038189105 hartree
energy: -1554.061686389178
dipole: -19.43813 18.95617 -0.48195 4.48786 -4.09778 0.39008 13.10020 -13.85517 -0.75497
magnitude: 0.97694 au
magnitude: 2.48320 debye
