program: Gaussian 09
title: 000006663
version: EM64L-G09RevD.01
frameworkgroup: C1[X(C16H24)]
method: RPBEPBE
basis: SDD
operation: Freq
keyword: #p
keyword: freq=noraman
keyword: PBEPBE/SDD
title: #p freq=noraman PBEPBE/SDD
converged: YES YES NO NO
title: Mulliken charges:
elementType: C C C C C C C C C C C C C C C C H H H H H H H H H H H H H H H H H H H H H H H H
charge: 0.178159 0.187930 -0.491161 -0.490736 0.308390 0.322324 -0.748147 -0.745296 -0.746706 -0.745857 -0.600745 -0.406374 0.499010 -0.473704 -0.545353 -0.675580 0.199429 0.207123 0.199177 0.206920 0.211088 0.223354 0.226126 0.208747 0.211895 0.223271 0.221727 0.225860 0.210792 0.208497 0.211244 0.223843 0.229494 0.223504 0.230674 0.206240 0.207185 0.222064 0.213764 0.221827
chargesum: 0.00000
title: Mulliken charges with hydrogens summed into heavy atoms:
elementType: C C C C C C C C C C C C C C C C
charge: 0.178159 0.187930 -0.084609 -0.084638 0.308390 0.322324 -0.087578 -0.101383 -0.088328 -0.102274 -0.371251 -0.182870 0.499010 -0.243029 -0.131928 -0.017925
polarizability: 2.05555488e+02 6.59411157e-01 1.76725858e+02 -3.22372246e+00 6.43970257e-01 1.24493945e+02
1716.lowfreq: -13.9107 -0.0006 -0.0004 0.0005 3.4655 12.4108 37.7734 51.4383 61.9184
frequency: 37.5887 51.2724 61.8905 108.4530 160.2677 179.8514 200.7217 208.0195 221.4144 236.9939 244.1588 258.8982 267.1739 277.8249 295.1976 320.8702 334.9416 360.3890 377.6551 384.3152 414.5793 460.0043 464.9820 496.6815 514.9495 533.9493 588.3702 629.2509 656.0056 686.5126 766.2337 772.3470 786.1657 825.7061 840.2133 875.6058 886.5040 908.7430 926.8192 929.1817 934.3962 956.0440 962.8891 968.6789 981.0013 1002.5586 1022.4674 1056.1215 1057.9519 1062.9153 1065.2619 1084.2877 1109.8587 1152.6937 1182.2947 1186.9392 1194.6685 1214.9805 1226.6141 1236.7495 1244.0963 1262.5007 1289.9376 1296.7987 1315.8135 1343.7648 1345.5942 1365.4652 1371.5584 1374.8420 1388.0422 1392.3610 1395.8591 1406.4116 1453.5309 1459.9148 1463.7937 1466.0756 1470.6900 1472.1716 1472.5837 1475.2148 1478.8611 1482.6965 1486.4071 1489.1624 1490.4139 1495.5331 1572.4850 1618.5981 2968.6265 2969.3804 2969.9332 2972.3407 2974.6373 2977.0781 2979.1272 2982.9185 3021.1458 3031.8118 3033.4525 3061.4976 3062.8172 3066.6616 3068.1769 3074.3507 3075.0046 3075.3648 3078.7800 3080.0002 3081.9766 3110.1226 3113.8915 3137.2435
redmass: 2.4252 2.8254 3.3125 3.1833 2.4493 1.7157 1.3730 1.5901 1.1418 1.3872 1.1865 1.2316 2.1735 2.4183 2.3489 2.6139 2.4559 2.4199 2.3192 2.2976 3.3377 2.9994 3.3764 2.7058 2.9369 2.9922 2.7757 3.7700 3.4559 5.5158 2.5308 3.2700 1.1924 2.3237 1.4343 2.6266 2.0560 1.5111 1.5075 1.5248 1.7458 1.7504 1.4338 1.4891 2.3224 1.2698 1.4612 1.5384 2.3532 1.9482 2.0858 1.6385 1.9803 1.5033 2.8406 1.7912 2.1459 2.9685 2.3131 1.8884 1.2491 1.8570 1.6333 1.9836 1.6600 1.4797 1.4718 5.6104 1.1950 1.1980 1.2061 1.2315 1.2467 2.5201 1.0666 1.0587 1.0520 1.0782 1.1127 1.0506 1.0838 1.0705 1.1668 1.0783 1.0702 1.0863 1.0844 1.8125 6.9944 6.3656 1.0368 1.0384 1.0515 1.0409 1.0396 1.0355 1.0548 1.0593 1.0996 1.1025 1.1017 1.0993 1.0992 1.0987 1.0983 1.0998 1.1000 1.0996 1.0990 1.0990 1.1011 1.0869 1.0890 1.0953
irintensity: 0.0390 0.0566 0.2776 0.9100 0.0690 0.1646 0.0293 0.0096 0.0279 0.0396 0.0095 0.0152 0.0271 0.0955 0.1489 0.3013 0.4490 0.0347 0.2283 0.3353 0.7578 0.1871 0.8083 0.1442 0.8476 9.6016 1.2580 3.4354 2.7772 0.2520 2.7498 0.0873 2.5131 1.8964 28.8480 9.8699 3.7529 7.7255 1.3626 0.2624 3.1142 0.6697 0.5713 0.1754 2.7876 0.7545 2.5656 5.4276 6.1091 12.0776 21.4403 4.7892 11.1768 2.4757 0.2159 8.8866 5.4930 2.6935 0.3942 3.4699 0.5329 2.7590 1.6199 16.7690 0.6431 0.5488 6.1458 1.6426 9.3405 30.5434 10.2776 8.7500 8.2546 15.0060 0.0163 0.6874 0.8037 0.6042 8.2739 11.1747 5.6212 13.2531 2.1698 20.3845 2.5142 7.4532 14.0925 51.4080 2.4951 7.0373 5.7445 26.7555 36.4823 8.7507 84.4240 49.4210 55.9349 35.6763 38.2916 49.6428 9.8591 2.7875 4.6423 40.6841 135.5986 5.6239 57.9006 39.1335 61.4395 22.5254 41.2328 11.3898 32.5651 27.4969
temp: 298.150 k
press: 1.00000 atm
elementType: 6 6 6 6 6 6 6 6 6 6 6 6 6 6 6 6 1 1 1 1 1 1 1 1 1 1 1 1 1 1 1 1 1 1 1 1 1 1 1 1
symmnumber: 1
zpe: 931996.2 jmol-1
zpe.correction: 0.354979 hartree
zpe.thermalcorrener: 0.371932 hartree
zpe.thermalcorrenthalpy: 0.372876 hartree
zpe.thermalcorrgfe: 0.311792 hartree
zpe.sumelectzpe: -622.883901 hartree
zpe.sumelectthermal: -622.866948 hartree
zpe.sumelectthermalent: -622.866004 hartree
zpe.sumelectthermalfe: -622.927088 hartree
dipole: -0.2403 0.2780 0.1134
dipole: 0.3846
quadrupole: -94.1406 -95.7661 -102.9527
quadrupole: -0.1241 -0.8704 -0.2191
quadrupole: 3.4792 1.8537 -5.3329 -0.1241 -0.8704 -0.2191
hfenergy: -623.23888 hartree
pointgroup: C01 [X(C16H24)]
dipole: -0.0988644 -0.1064044 -0.0423852 debye
polarizability: 205.54479|-1.6323264|176.8122013|2.2184658|0.0807104|124.4182998 unknown
InChI: InChI=1S/C16H24/c1-6-12-7-8-13-14(11-12)16(4,5)10-9-15(13,2)3/h7-8,11H,6,9-10H2,1-5H3
charge 0 multiplicity 1
40 atoms
C  -0.925956 -1.760262 0.022873
C  -1.959731 1.178619 -0.095294
C  -2.325906 -1.335161 -0.502803
C  -2.852811 -0.063888 0.180776
C  0.013541 -0.533246 0.100344
C  -0.464802 0.813366 0.059296
C  -1.058608 -2.390336 1.443542
C  -0.36835 -2.841661 -0.947077
C  -2.208743 1.70025 -1.543833
C  -2.376345 2.291116 0.909827
C  1.408733 -0.755024 0.253007
C  0.488428 1.864267 0.13702
C  2.353819 0.291605 0.335637
C  1.867687 1.621113 0.270844
C  3.844991 0.000794 0.43697
C  4.522452 -0.100336 -0.956674
H  -3.032473 -2.174427 -0.346949
H  -2.265884 -1.172467 -1.597437
H  -3.883271 0.15673 -0.161827
H  -2.913372 -0.228897 1.275091
H  -1.689116 -3.299329 1.40379
H  -0.067389 -2.675286 1.840723
H  -1.51261 -1.683926 2.161231
H  0.553608 -3.31593 -0.566365
H  -1.119684 -3.643321 -1.081843
H  -0.145754 -2.40709 -1.938772
H  -1.56792 2.57359 -1.763316
H  -1.983467 0.926574 -2.299513
H  -3.265171 2.007968 -1.665127
H  -1.89405 3.260502 0.690975
H  -3.470904 2.448236 0.859101
H  -2.116373 2.006346 1.945743
H  1.778366 -1.786978 0.305971
H  0.14018 2.902987 0.101421
H  2.569617 2.462364 0.332445
H  4.34396 0.798104 1.021081
H  4.007628 -0.94691 0.985738
H  4.065722 -0.90824 -1.556713
H  5.603754 -0.310502 -0.858842
H  4.403507 0.842882 -1.520261
